program: Gaussian 09
title: 000026439
version: EM64L-G09RevD.01
frameworkgroup: C1[X(C10H9ClO2)]
method: RPBEPBE
basis: SDD
operation: Freq
keyword: #p
keyword: freq=noraman
keyword: PBEPBE/SDD
title: #p freq=noraman PBEPBE/SDD
converged: YES YES NO NO
title: Mulliken charges:
elementType: Cl O O C C C C C C C C C C H H H H H H H H H
charge: -0.062480 -0.251698 -0.216540 0.507400 0.326752 -0.373484 -0.313762 -0.352969 -0.348568 -0.193660 -0.215273 -0.536845 -0.122974 0.237470 0.258120 0.248554 0.258853 0.251039 0.227555 0.227963 0.252878 0.191667
chargesum: 0.00000
title: Mulliken charges with hydrogens summed into heavy atoms:
elementType: Cl O O C C C C C C C C C C
charge: -0.062480 -0.251698 -0.216540 0.507400 0.326752 -0.136014 -0.055641 -0.104415 -0.089715 -0.193660 0.035767 0.171551 0.068693
polarizability: 2.59398173e+02 -1.66213052e+01 1.32797583e+02 -8.39946868e-01 -2.15607829e+00 5.54314992e+01
1716.lowfreq: -4.5207 -3.6849 0.0008 0.0016 0.0019 5.4772 36.0035 57.4279 94.8080
frequency: 35.9640 57.4047 94.8058 114.4631 155.4612 183.4257 199.4335 216.8647 229.4465 290.1816 313.4645 359.0120 409.6780 420.0831 466.0016 493.5007 558.5238 581.7842 622.6899 660.0650 733.2152 756.9253 812.3271 845.3425 857.7518 872.3606 949.0546 973.1859 974.3979 980.1612 999.2252 1111.4187 1119.8441 1140.5148 1157.9009 1186.4268 1234.4622 1250.8451 1255.0300 1309.6389 1360.9885 1375.1076 1433.5735 1437.1309 1468.5177 1470.6751 1495.4959 1561.5263 1575.8798 1598.1536 1621.0711 2945.5703 2969.8993 3062.6659 3134.9574 3136.0461 3148.6130 3159.0555 3171.4285 3179.7683
redmass: 4.7166 4.6882 6.8083 4.2470 4.4744 3.3249 3.1461 2.1090 1.8406 6.0815 4.7142 6.0086 3.2005 6.0968 4.2885 3.4640 6.0694 3.4699 6.7908 5.4347 3.7202 5.9309 1.3133 1.4753 1.3331 6.6540 1.3672 1.7514 1.3692 8.6536 2.6006 1.2590 1.5660 3.3996 1.3280 1.2785 1.8853 2.2098 2.4339 1.2880 2.8890 1.5554 2.4791 1.4592 1.0580 1.0739 2.4021 6.9652 5.7479 7.5218 6.4053 1.0865 1.0326 1.1045 1.0997 1.0897 1.0874 1.0880 1.0953 1.0972
irintensity: 1.7156 0.0644 3.5325 8.0311 1.3318 7.7357 5.2341 2.0167 0.6616 3.2162 4.4137 8.6707 1.2287 22.4388 0.9672 11.0210 35.3891 6.3545 10.1297 16.7757 0.2007 8.3337 11.1608 108.3451 7.0654 24.6204 0.4567 1.0722 0.1603 49.9151 8.7373 0.1729 33.0233 293.9798 22.4876 154.3163 23.0840 87.9923 167.8899 3.4188 63.3287 32.5671 0.4281 18.2554 29.0706 59.6562 83.2008 31.3525 426.2618 416.1957 85.3059 74.5656 66.1017 40.7531 24.4385 2.0298 2.3977 1.2812 10.7970 4.4626
temp: 298.150 k
press: 1.00000 atm
elementType: 17 8 8 6 6 6 6 6 6 6 6 6 6 1 1 1 1 1 1 1 1 1
symmnumber: 1
zpe: 426399.4 jmol-1
zpe.correction: 0.162407 hartree
zpe.thermalcorrener: 0.174976 hartree
zpe.thermalcorrenthalpy: 0.175920 hartree
zpe.thermalcorrgfe: 0.122285 hartree
zpe.sumelectzpe: -995.993651 hartree
zpe.sumelectthermal: -995.981083 hartree
zpe.sumelectthermalent: -995.980138 hartree
zpe.sumelectthermalfe: -996.033773 hartree
dipole: -6.6821 -0.1330 0.4290
dipole: 6.6971
quadrupole: -89.6284 -81.4795 -85.4085
quadrupole: 19.9567 0.0321 -2.5109
quadrupole: -4.1230 4.0260 0.0970 19.9567 0.0321 -2.5109
hfenergy: -996.1560581 hartree
pointgroup: C01 [X(C10H9Cl1O2)]
dipole: 2.6253173 -0.1655361 -0.1509543 debye
dipolederiv: -0.273166 0.2492812 0.0005188 0.2167815 -0.6543289 0.009598 0.0388384 0.0039503 -0.0557978 -2.164538 0.3648437 0.0588291 0.3281851 -0.3849848 -0.0193563 0.0131956 -0.0089946 -0.2963049 -1.2060007 -0.2899713 -0.0233177 -0.7383822 -0.7111441 -0.0118979 0.001375 0.0013198 -0.3485743 -0.9743707 0.0389077 -0.0063833 0.2431304 -0.3052448 -0.0291515 -0.0432738 -0.043068 0.0073661 1.9580047 -0.2439416 -0.0089306 0.0267097 0.1095959 -0.0029172 0.1080245 -0.0166815 0.1186121 0.4170915 -0.0460458 0.003671 -0.3436044 0.0831713 0.0781127 -0.0079344 0.0845633 -0.0835027 0.5063552 0.0010603 0.0138904 0.2416624 0.0712051 0.0742711 0.045808 0.0522062 -0.1060275 -0.6879975 0.0189037 -0.0066661 -0.436021 -0.0374452 0.04585 -0.1813919 0.0471727 -0.1750691 -0.5763639 0.1020993 0.0283484 0.5414359 -0.0178987 0.0594583 0.1610675 0.0519023 -0.1412478 1.7354719 -0.1528396 0.0150347 0.0746124 1.1544806 -0.0335196 0.0533061 -0.0092193 -0.0421934 -1.6663582 -0.3656324 -0.020905 -0.2974291 -0.3507932 -0.0152662 -0.1153436 -0.0307235 -0.1467174 0.6808249 -0.1670703 -0.0458633 -0.6504076 0.4504961 0.0234147 -0.1896301 0.0360414 0.3228519 2.045686 0.5242866 0.0644227 0.2445329 0.7130147 -0.0174241 0.0251297 0.0016424 0.1272124 0.0402284 -0.0855137 -0.0400814 -0.0576617 0.0117087 -0.0552002 -0.0293571 -0.0424101 0.1230011 0.0962612 0.0684258 0.0212289 0.0356841 0.0148414 -0.0484513 0.02026 -0.0320798 0.1411788 0.0243341 0.0745206 0.0192244 0.0942683 -0.0105285 -0.059111 0.0146217 -0.0627229 0.1466212 0.0274699 -0.0670992 -0.0291776 -0.0707433 0.0261479 -0.050435 -0.0242071 -0.0489636 0.1512395 0.0336202 0.0253056 -0.0106042 0.1083612 -0.0198752 0.0152589 0.0239912 0.0019453 0.1636638 0.069415 -0.007907 -0.0776429 0.1523916 0.0094608 -0.0515997 0.0544201 -0.0736614 -0.135455 0.0628485 -0.0695183 0.0699122 0.1393962 -0.1012415 0.0822131 0.0576114 0.0891248 -0.0103353 -0.1555439 0.0008715 -0.0153915 -0.0380608 0.08923 -0.0158777 -0.0299464 -0.0127597 0.1211906 0.0067273 0.027033 -0.0101172 0.1851584 -0.1398676 0.0220307 0.0034353 0.0114159 0.1182877 unknown
polarizability: 260.7140063|9.8025733|129.6237853|3.6935333|11.891985|57.2894637 unknown
InChI: InChI=1S/C10H9ClO2/c1-13-9-4-2-8(3-5-9)10(11)6-7-12/h2-7H,1H3
charge 0 multiplicity 1
22 atoms
Cl -2.442468 2.15046 -0.001773
O  3.95826 0.158177 0.184636
O  -4.821375 -1.574132 -0.090889
C  -0.276867 0.368535 0.038389
C  2.566752 0.154211 0.111535
C  0.381376 -0.83974 -0.337229
C  0.535481 1.472826 0.436047
C  1.781847 -0.955025 -0.30298
C  1.931769 1.369731 0.477032
C  -1.7440 0.440348 0.014279
C  -2.6241 -0.612855 0.001855
C  4.672164 -1.073235 -0.179103
C  -4.086411 -0.541838 -0.088378
H  -0.204795 -1.695147 -0.688034
H  0.058143 2.414471 0.721625
H  2.248949 -1.895526 -0.60876
H  2.55478 2.213244 0.787905
H  -2.216391 -1.628186 0.079137
H  4.488381 -1.3428 -1.236449
H  4.380422 -1.91254 0.480275
H  5.736031 -0.837981 -0.034361
H  -4.527049 0.478603 -0.15806
