program: Gaussian 09
title: 000274949
version: EM64L-G09RevD.01
frameworkgroup: C1[X(C21H14N2O3)]
method: RPBEPBE
basis: SDD
operation: Freq
keyword: #p
keyword: freq=noraman
keyword: PBEPBE/SDD
title: #p freq=noraman PBEPBE/SDD
converged: YES YES NO NO
title: Mulliken charges:
elementType: O O O N N C C C C C C C C C C C C C C C C C C C C C H H H H H H H H H H H H H H
charge: -0.263540 -0.256601 -0.407129 -0.029464 -0.077415 0.219524 0.240513 0.239528 0.261904 -0.308978 -0.553179 -0.387321 -0.416004 -0.409298 0.251278 -0.385383 -0.228592 -0.240001 0.497892 0.218885 0.173334 -0.495353 -0.390378 -0.377614 -0.336429 -0.203336 0.284448 0.248395 0.248792 0.298019 0.255353 0.228649 0.231230 0.298555 0.223134 0.234420 0.254371 0.240655 0.241027 0.376109
chargesum: 0.00000
title: Mulliken charges with hydrogens summed into heavy atoms:
elementType: O O O N N C C C C C C C C C C C C C C C C C C C C C
charge: -0.263540 -0.256601 -0.031020 -0.029464 -0.077415 0.219524 0.240513 0.239528 0.261904 -0.308978 -0.268730 -0.138926 -0.167211 -0.111279 0.251278 -0.130030 0.000057 -0.008771 0.497892 0.218885 0.173334 -0.196799 -0.167244 -0.143193 -0.082058 0.278346
polarizability: 6.22780298e+02 -1.91480686e+01 2.69906098e+02 1.31526204e+00 3.42655525e+00 1.12236101e+02
1716.lowfreq: -6.8965 -3.4934 -0.0011 -0.0007 -0.0005 2.6840 14.7009 19.9042 26.0605
frequency: 14.1658 19.8693 26.0474 34.8495 70.9500 99.4048 106.2956 126.1404 142.5945 168.7770 185.7835 209.6999 215.1541 230.9879 268.5796 295.5479 346.8842 362.3542 368.7381 395.5449 397.8024 401.6525 432.1527 455.4621 457.1761 475.8786 511.7204 520.6672 527.9658 562.5921 589.7245 595.4826 616.4742 626.6263 665.4522 679.1521 682.5105 721.0696 725.1343 743.9922 753.9918 766.4012 788.3336 792.0508 805.3237 812.5816 831.9635 841.5485 852.3675 897.2921 906.5138 910.9936 911.8808 932.3363 935.3562 964.9154 967.8648 975.6413 978.8434 981.7944 994.0863 1000.0474 1033.1592 1058.1371 1066.6732 1073.4874 1111.4675 1120.5911 1126.0927 1139.3259 1165.7492 1174.4261 1191.8813 1217.6998 1236.0705 1257.1078 1263.6075 1280.2213 1297.9333 1317.9843 1348.0211 1363.1259 1369.5959 1393.8949 1404.9510 1442.4130 1447.7078 1450.1215 1459.9286 1476.9321 1480.8599 1487.3628 1572.6845 1578.4014 1586.0759 1597.7513 1607.8576 1615.3041 1622.8461 1627.2042 2953.4384 3017.4388 3096.6978 3128.2136 3137.1231 3137.9601 3142.6925 3151.7854 3160.2521 3166.4568 3184.1480 3187.3695 3195.7768 3557.8043
redmass: 2.5781 5.0155 5.9924 6.3529 6.2469 7.3729 5.0783 5.2970 4.8580 6.6165 5.9790 6.0900 3.7920 6.6082 6.7565 6.4743 4.4012 8.1845 4.8497 6.4663 3.4366 4.2700 2.9808 1.9251 2.5943 4.8009 3.2523 4.5355 6.3075 5.4197 5.2727 4.2632 4.2345 6.6862 7.3075 5.7138 5.4308 5.6995 4.4062 6.0312 1.5535 6.6792 4.8567 3.5011 2.4679 1.3611 6.4889 10.4102 1.6033 1.5435 1.5604 1.8784 3.8112 1.3565 3.4654 1.4347 1.4227 1.9213 3.8555 3.7040 1.3427 3.9587 1.9615 3.7181 1.4543 2.7370 1.6653 1.0369 1.5716 1.5451 1.6726 1.3155 1.9016 2.5106 2.2593 1.3663 3.2817 1.5603 1.4811 1.6172 2.6701 2.0548 1.9136 3.9707 2.9078 2.4454 3.6243 3.7035 4.0132 3.7339 3.6383 1.2155 7.3331 7.2105 7.3514 7.3411 7.4763 7.3897 8.1913 7.5527 1.0862 1.0534 1.1190 1.0858 1.0891 1.0900 1.0916 1.0919 1.0980 1.0958 1.0950 1.0939 1.0953 1.0675
irintensity: 14.1296 0.4498 1.5618 0.2171 0.3342 0.6723 2.1395 0.5992 0.5701 0.0706 0.3028 1.1011 15.4247 4.0098 1.6457 2.5699 7.6375 8.8393 0.7377 9.2107 10.0762 18.7744 11.5522 26.9883 22.3496 11.7353 43.8454 24.0379 1.1835 1.2734 2.3304 6.1418 24.3055 15.7091 9.9754 0.6639 0.4015 2.3694 3.6722 3.0134 91.5373 11.4685 10.9750 11.5414 16.3855 35.6023 113.3278 26.3382 30.5443 0.3897 17.0798 71.0246 79.1412 7.9025 19.6472 7.2744 2.5506 52.1307 136.3337 19.5481 0.5209 10.9743 1.4285 35.7497 4.3699 6.8382 1.3386 0.0054 6.2610 27.2163 14.2836 10.1768 53.5349 43.7697 125.3575 45.0293 283.9322 9.6047 41.1614 31.2537 39.5133 3.0541 14.3998 10.0773 36.2611 99.0522 37.3575 116.3521 104.8334 68.9921 56.7190 21.2714 192.4630 2.8550 32.7365 3.4433 7.5874 20.3504 5.2237 31.7615 46.7392 167.4182 30.0510 3.6910 10.6579 7.3407 14.5541 2.6639 42.8089 10.5085 4.4677 8.4435 8.7839 81.3190
temp: 298.150 k
press: 1.00000 atm
elementType: 8 8 8 7 7 6 6 6 6 6 6 6 6 6 6 6 6 6 6 6 6 6 6 6 6 6 1 1 1 1 1 1 1 1 1 1 1 1 1 1
symmnumber: 1
zpe: 777339.4 jmol-1
zpe.correction: 0.296073 hartree
zpe.thermalcorrener: 0.316617 hartree
zpe.thermalcorrenthalpy: 0.317561 hartree
zpe.thermalcorrgfe: 0.243773 hartree
zpe.sumelectzpe: -1141.975571 hartree
zpe.sumelectthermal: -1141.955027 hartree
zpe.sumelectthermalent: -1141.954083 hartree
zpe.sumelectthermalfe: -1142.027871 hartree
dipole: -0.8866 1.0777 0.5058
dipole: 1.4844
quadrupole: -113.6090 -129.3662 -153.7314
quadrupole: -0.2087 1.7577 -1.1259
quadrupole: 18.6265 2.8693 -21.4959 -0.2087 1.7577 -1.1259
hfenergy: -1142.2716441 hartree
pointgroup: C01 [X(C21H14N2O3)]
dipole: 0.3529121 0.2942953 -0.3604137 debye
polarizability: 622.9314896|17.8677289|237.1910763|-2.4211056|-63.8015684|144.7999302 unknown
InChI: InChI=1S/C21H14N2O3/c24-23-21-17-4-2-1-3-15(17)16-7-6-14(10-18(16)21)22-11-13-5-8-19-20(9-13)26-12-25-19/h1-11,24H,12H2
charge 0 multiplicity 1
40 atoms
O  6.508085 -0.880949 1.391606
O  7.614887 0.484675 -0.246576
O  -4.325278 3.165455 -1.047558
N  -3.121697 2.38086 -0.794209
N  1.308112 -0.697271 0.250277
C  -2.928636 -1.053104 0.298313
C  -4.395618 -0.898365 0.24012
C  -2.329015 0.184896 -0.095989
C  -4.703298 0.438067 -0.18892
C  -3.419802 1.151209 -0.40662
C  -0.937929 0.349397 -0.135643
C  -2.11074 -2.13803 0.674459
C  -5.428956 -1.810164 0.525033
C  -6.041361 0.858118 -0.333747
C  -0.107682 -0.755888 0.227856
C  -0.70925 -1.978676 0.650317
C  -6.773299 -1.384577 0.37933
C  -7.075862 -0.067457 -0.044694
C  3.443697 0.17785 -0.526516
C  5.562995 -0.323289 0.493292
C  6.221502 0.480788 -0.469797
C  4.185366 -0.496959 0.497698
C  1.982904 0.046426 -0.595335
C  4.11324 0.983136 -1.490211
C  5.521567 1.149931 -1.477468
C  7.834334 -0.387679 0.943298
H  -0.502151 1.316259 -0.406586
H  -2.547509 -3.090589 0.992925
H  -5.205876 -2.831224 0.852888
H  -6.268083 1.874638 -0.659623
H  -0.042577 -2.792928 0.950631
H  -7.58952 -2.082481 0.597169
H  -8.122091 0.239705 -0.149594
H  3.658404 -1.111299 1.231064
H  1.488888 0.59649 -1.424258
H  3.523635 1.487959 -2.264129
H  6.038317 1.767503 -2.215606
H  8.458496 -1.246656 0.643226
H  8.28775 0.216293 1.747574
H  -3.951151 4.043428 -1.3180
