program: Gaussian 09
title: 000274980
version: EM64L-G09RevD.01
frameworkgroup: C1[X(C32H20N2O2)]
method: RPBEPBE
basis: SDD
operation: Freq
keyword: #p
keyword: freq=noraman
keyword: PBEPBE/SDD
title: #p freq=noraman PBEPBE/SDD
converged: YES YES NO NO
title: Mulliken charges:
elementType: O O N N C C C C C C C C C C C C C C C C C C C C C C C C C C C C C C C C H H H H H H H H H H H H H H H H H H H H
charge: -0.282977 -0.282970 -0.080085 -0.080091 0.210070 0.210063 0.214197 0.214204 0.387545 0.387536 0.276748 0.276736 0.331787 0.331779 -0.392698 -0.392704 0.047007 0.047016 -0.375868 -0.375898 -0.445594 -0.445590 -0.434014 -0.434011 -0.244414 -0.244414 -0.363842 -0.363849 -0.375061 -0.375056 -0.453705 -0.453713 -0.259993 -0.259982 -0.245428 -0.245429 0.257944 0.257944 0.244091 0.244115 0.241656 0.241655 0.239091 0.239090 0.231838 0.231839 0.257963 0.257968 0.273358 0.273358 0.277537 0.277556 0.231114 0.231114 0.231734 0.231734
chargesum: 0.00000
title: Mulliken charges with hydrogens summed into heavy atoms:
elementType: O O N N C C C C C C C C C C C C C C C C C C C C C C C C C C C C C C C C
charge: -0.282977 -0.282970 -0.080085 -0.080091 0.210070 0.210063 0.214197 0.214204 0.387545 0.387536 0.276748 0.276736 0.331787 0.331779 -0.134755 -0.134760 0.047007 0.047016 -0.131777 -0.131783 -0.203938 -0.203935 -0.194923 -0.194921 -0.012577 -0.012576 -0.105879 -0.105881 -0.101703 -0.101698 -0.176167 -0.176157 -0.028879 -0.028868 -0.013695 -0.013695
polarizability: 9.50521699e+02 9.99436303e-03 4.04315906e+02 1.10677267e-02 -3.11531411e+01 1.77343946e+02
1716.lowfreq: -3.6447 -1.2585 -0.0017 0.0013 0.0017 4.8936 10.8242 16.1443 20.5419
frequency: 10.6129 16.1001 20.4918 26.2420 46.5631 49.1445 63.1672 81.8803 99.3774 114.2901 116.8227 137.8395 140.9791 165.5553 175.5397 181.1877 198.3115 221.8457 242.7106 286.3763 291.7014 314.4781 333.7697 353.2867 379.3097 407.5067 408.1407 424.3634 424.4343 430.2773 466.4408 473.3132 473.4147 485.0865 496.2304 517.3191 524.2723 528.5346 534.6974 536.2111 565.7113 568.6829 628.2557 634.7951 635.2970 654.2703 655.9894 676.1296 676.2460 686.4400 693.0509 722.4646 749.6694 749.7404 758.9703 784.8831 784.9217 789.0183 789.0451 801.0849 801.2975 817.7116 817.8102 845.2377 845.2454 856.1631 874.9125 879.5647 880.1582 885.6698 885.9857 909.1750 909.3351 927.2006 927.2864 957.7538 957.9655 967.4968 967.5063 988.0911 989.1739 989.2224 995.5687 996.3662 996.4167 999.5553 1005.8022 1029.3678 1029.8555 1031.6244 1075.2299 1075.5915 1093.7955 1102.7370 1113.0866 1128.8989 1136.6743 1154.3909 1154.4540 1176.5106 1176.5819 1190.9412 1194.1582 1194.9303 1222.1366 1222.2366 1239.6226 1239.6282 1260.2854 1260.3041 1265.4834 1266.5465 1290.6575 1291.1196 1311.1157 1369.6622 1372.9816 1375.7674 1397.5731 1397.7717 1412.5214 1412.5276 1429.5830 1442.1945 1442.6049 1447.1876 1449.7212 1450.5094 1511.2167 1518.4645 1518.5615 1537.3178 1540.1688 1552.5170 1578.5435 1586.1727 1587.0730 1592.1765 1592.2976 1621.8893 1630.4142 1630.4259 3124.5224 3124.5318 3128.4194 3128.4273 3137.9605 3137.9690 3150.4238 3150.4565 3153.1681 3153.7966 3158.4904 3158.5264 3170.4883 3170.5049 3171.2056 3175.6162 3176.2860 3176.3103 3250.0576 3250.1123
redmass: 5.9239 5.0867 6.2926 6.6876 4.4844 5.6800 4.8708 5.0077 5.8735 6.6812 6.4941 7.3926 6.5665 5.1853 4.2969 4.2551 4.4078 5.6589 6.2461 5.4124 6.5320 5.6245 5.5862 7.0186 6.2516 2.9120 5.3906 3.3980 3.3794 4.4984 5.8969 3.2850 3.2721 7.0259 5.6471 3.5423 7.1722 6.9239 4.8435 4.4099 3.9976 4.1433 6.9615 3.7733 3.8404 6.3349 6.3130 3.6266 3.6565 8.1771 5.8639 7.1133 1.3632 1.3637 4.2056 2.8591 2.9171 2.6601 2.6178 5.2027 5.2407 1.5472 1.5425 1.4241 1.4240 1.3342 1.5257 4.4659 3.9773 2.1860 2.3285 7.1198 7.1127 1.4209 1.4212 6.9259 6.8094 1.3839 1.3846 1.3762 1.3675 1.3678 4.9997 1.3513 1.4109 8.4833 1.3631 2.5986 2.4946 2.5958 2.2915 2.2369 2.8541 3.1069 1.8899 2.0254 1.5684 1.3700 1.3650 1.1258 1.1239 1.1613 1.4945 1.4406 2.4428 2.5598 2.2292 2.1643 1.7687 1.7275 2.9498 4.0723 1.7463 1.8075 1.3243 4.1658 2.8723 3.6091 2.3787 2.3995 6.9699 6.9639 4.0735 2.3756 2.3618 2.6318 2.3790 2.4265 10.9342 3.8799 3.8847 7.1952 7.2978 6.5910 7.1908 7.2442 7.3347 5.4305 5.4066 6.1103 6.5443 6.5448 1.0867 1.0867 1.0872 1.0872 1.0899 1.0899 1.0926 1.0926 1.0879 1.0885 1.0963 1.0963 1.0974 1.0975 1.0967 1.0978 1.0962 1.0962 1.0985 1.0985
irintensity: 0.0822 0.0022 0.1576 0.0008 0.0156 0.0779 0.0534 0.0181 0.0010 0.0270 0.3446 0.1584 0.2849 3.5104 0.9994 1.8533 0.0161 0.9735 0.0580 1.6827 0.4109 8.3855 8.0141 0.4313 3.3552 0.0069 5.6147 3.4134 15.6693 0.6417 3.1945 0.2341 0.8366 0.7388 2.4530 0.6810 0.5574 0.0170 4.5344 6.6427 10.7301 1.7994 0.3453 0.4540 0.0171 4.2443 27.0103 11.5942 4.6145 1.9324 27.2258 0.3575 1.3973 3.2894 0.0462 18.1616 46.0687 7.8436 81.7146 0.9532 17.3352 7.7799 132.4040 9.3792 11.2396 15.4136 44.8980 0.8412 11.9752 1.8453 12.6489 22.3478 0.6078 0.1025 0.4858 8.2143 1.5583 0.1568 3.1513 0.1361 2.6056 0.7239 12.6442 1.1506 1.7336 13.5400 0.0033 9.3659 4.6675 14.5246 6.9949 3.0272 14.2980 4.2026 17.5682 0.5204 8.5242 0.0017 0.0011 3.0116 0.2002 0.0383 7.3996 0.0465 5.4630 0.8022 10.1660 4.4438 2.1845 6.6675 13.2800 0.5750 6.4121 3.1709 2.4203 3.6601 40.3645 12.0086 29.6038 4.3084 0.1039 0.0307 12.5935 58.3391 2.1842 61.3628 3.7719 74.0636 17.8453 0.0032 17.8376 76.8095 2.0238 9.9352 9.6181 0.3055 3.0415 5.8900 0.1244 4.5874 0.0445 0.3514 1.2709 1.5615 0.9999 0.7011 10.9990 14.1846 11.4004 37.6047 1.3466 6.5423 86.3442 5.9501 1.7457 25.2529 4.8930 0.2818 12.4405 17.9643 32.1240 5.2045
temp: 298.150 k
press: 1.00000 atm
elementType: 8 8 7 7 6 6 6 6 6 6 6 6 6 6 6 6 6 6 6 6 6 6 6 6 6 6 6 6 6 6 6 6 6 6 6 6 1 1 1 1 1 1 1 1 1 1 1 1 1 1 1 1 1 1 1 1
symmnumber: 1
zpe: 1116410.4 jmol-1
zpe.correction: 0.425218 hartree
zpe.thermalcorrener: 0.452193 hartree
zpe.thermalcorrenthalpy: 0.453137 hartree
zpe.thermalcorrgfe: 0.364188 hartree
zpe.sumelectzpe: -1488.978673 hartree
zpe.sumelectthermal: -1488.951698 hartree
zpe.sumelectthermalent: -1488.950754 hartree
zpe.sumelectthermalfe: -1489.039703 hartree
dipole: 0.0001 3.3615 0.5046
dipole: 3.3992
quadrupole: -142.9789 -192.8869 -213.9241
quadrupole: 0.0025 0.0003 -8.7312
quadrupole: 40.2844 -9.6236 -30.6608 0.0025 0.0003 -8.7312
hfenergy: -1489.403891 hartree
pointgroup: C01 [X(C32H20N2O2)]
dipole: 0.0006808 0.9972787 -0.8910132 debye
polarizability: 950.5212796|-0.5397975|239.2755213|-0.1586056|-105.7906806|342.3847507 unknown
InChI: InChI=1S/C32H20N2O2/c1-3-11-25-21(7-1)9-5-13-27(25)29-19-33-31(35-29)23-15-17-24(18-16-23)32-34-20-30(36-32)28-14-6-10-22-8-2-4-12-26(22)28/h1-20H
charge 0 multiplicity 1
56 atoms
O  -3.577612 -0.176715 -0.006467
O  3.57859 -0.182354 -0.007443
N  -3.703766 -1.849069 1.550794
N  3.702511 -1.85441 1.550323
C  -7.264594 0.63191 -0.073261
C  7.266705 0.620869 -0.075072
C  -5.919652 0.347896 -0.541228
C  5.921329 0.338526 -0.542805
C  -8.180783 1.313813 -0.970136
C  8.183797 1.301009 -0.972362
C  -4.9577 -0.417098 0.252402
C  4.958359 -0.424722 0.251271
C  -1.42065 -1.073674 0.803661
C  1.420429 -1.075821 0.803363
C  -5.520305 0.801612 -1.815206
C  5.522527 0.792167 -1.816978
C  -2.87451 -1.087704 0.828063
C  2.874271 -1.092033 0.827493
C  -7.730745 0.306729 1.244216
C  7.732469 0.295744 1.242556
C  -7.734669 1.730091 -2.266704
C  7.738181 1.717248 -2.269114
C  -9.521906 1.58276 -0.537645
C  9.525323 1.568296 -0.540091
C  -6.419799 1.494335 -2.672017
C  6.422944 1.483168 -2.67421
C  -0.701561 -0.163492 -0.020972
C  0.702546 -0.16456 -0.021127
C  -0.701364 -1.986853 1.628124
C  0.699936 -1.987906 1.627983
C  -4.999676 -1.441319 1.200616
C  4.998971 -1.44869 1.199815
C  -9.039797 0.592649 1.641459
C  9.04194 0.580048 1.639578
C  -9.952341 1.221502 0.739186
C  9.955318 1.207126 0.736914
H  -4.501993 0.591956 -2.155576
H  4.503889 0.583786 -2.157159
H  -7.041292 -0.137686 1.966357
H  7.042426 -0.147323 1.964965
H  -8.440689 2.241621 -2.931204
H  8.444878 2.227437 -2.933927
H  -10.203866 2.089691 -1.230611
H  10.207955 2.073904 -1.233364
H  -6.076455 1.823324 -3.658272
H  6.079998 1.812146 -3.660607
H  -1.25215 0.542015 -0.650357
H  1.254076 0.540108 -0.650627
H  -1.264629 -2.682146 2.25808
H  1.26228 -2.684037 2.257836
H  -5.868435 -1.942011 1.616732
H  5.867058 -1.950538 1.615944
H  -9.366924 0.343358 2.656784
H  9.368769 0.330854 2.655023
H  -10.978029 1.433103 1.059672
H  10.981318 1.417466 1.057231
