program: Gaussian 09
title: 000026498
version: EM64L-G09RevD.01
frameworkgroup: C1[X(C9H20N4)]
method: RPBEPBE
basis: SDD
operation: Freq
keyword: #pfreq=noraman
keyword: PBEPBE/SDD
title: #p freq=noraman PBEPBE/SDD
converged: YES YES NO NO
title: Mulliken charges:
elementType: N N N N C C C C C C C C C H H H H H H H H H H H H H H H H H H H H
charge: -0.338986 -0.100529 -0.633912 -0.655804 0.020876 -0.457372 -0.417377 -0.395317 -0.396030 -0.384231 -0.377038 -0.468102 0.200734 0.169876 0.208106 0.179082 0.202376 0.203586 0.195559 0.191804 0.190118 0.196030 0.194175 0.189476 0.232595 0.215118 0.196032 0.204059 0.184804 0.318004 0.290462 0.308123 0.333703
chargesum: 0.00000
title: Mulliken charges with hydrogens summed into heavy atoms:
elementType: N N N N C C C C C C C C C
charge: -0.106391 -0.100529 -0.025446 -0.013978 0.190752 -0.070183 -0.011415 -0.007954 -0.009882 -0.000580 0.034112 -0.079240 0.200734
polarizability: 1.73737266e+02 3.83194671e+00 1.12195275e+02 4.88088072e+00 -5.03240061e+00 9.84676862e+01
1716.lowfreq: -5.8485 -0.0005 -0.0004 -0.0002 6.6358 13.7854 24.2750 38.7165 51.3822
frequency: 22.2282 38.5848 51.3227 68.1883 107.0551 138.2637 181.2781 215.6337 221.3463 248.1772 303.8045 325.8556 363.6461 392.7928 411.0570 433.4158 437.9993 452.7248 460.0295 489.4452 548.2382 565.3423 587.9187 678.7800 692.7864 781.1618 787.7283 810.7564 843.3638 877.2608 886.1957 893.6701 921.3285 963.7598 999.6545 1035.2855 1040.9567 1050.2208 1050.9956 1060.3854 1082.5991 1105.5970 1112.9268 1142.9473 1148.7554 1169.9095 1185.1624 1208.6558 1239.8464 1250.2347 1256.8765 1279.8948 1292.2858 1308.9100 1313.8933 1333.8849 1339.8491 1341.3510 1343.1438 1363.1245 1376.4193 1406.7949 1455.0511 1460.3859 1461.5428 1463.5846 1467.3046 1469.5332 1477.3625 1489.6566 1600.7551 1617.1294 1672.9690 2816.9317 2871.7712 2889.9222 2924.0553 2956.9209 2964.2386 2966.4230 2968.1189 2978.9390 3015.5275 3025.7864 3027.8991 3035.9958 3043.3830 3047.5904 3393.7780 3521.1254 3546.2498 3669.6345 3691.3324
redmass: 3.9983 3.2204 3.2717 2.7277 2.9182 2.9139 3.2732 3.3658 1.8398 2.8467 3.0283 1.8550 1.3513 1.5322 1.5012 2.3180 1.3497 2.0001 2.5183 2.0314 2.4980 1.4497 2.3485 5.0331 1.3938 2.0001 1.6247 1.1769 2.1079 1.8842 3.7550 1.6271 1.8363 2.4318 2.6081 1.4711 2.4227 1.4642 1.8226 1.3034 2.3018 1.4551 2.5304 2.6983 2.8776 1.2420 2.0382 1.5231 1.3415 1.2547 1.2594 1.1195 1.1982 1.3477 1.2834 1.3675 1.5187 1.4793 1.4447 1.4918 1.5223 4.4166 1.1367 1.1048 1.0897 1.0931 1.1683 1.0869 1.0966 1.0847 1.2280 1.2763 3.6124 1.0804 1.0561 1.0730 1.0973 1.0594 1.0618 1.0602 1.0666 1.0616 1.0990 1.0958 1.0994 1.1018 1.0966 1.0969 1.0733 1.0450 1.0454 1.1016 1.1025
irintensity: 4.6773 0.1309 1.4900 1.3392 2.6557 0.1467 2.4687 2.6662 0.1473 7.8519 5.5032 1.6819 76.0869 75.7686 56.4166 81.0184 145.3917 12.5061 12.4510 15.2784 28.0057 178.5288 51.3688 88.6792 73.3781 1.6438 0.3403 0.5578 6.1048 7.0613 4.1957 11.3097 1.8130 5.4000 14.4214 6.7897 1.7097 2.5895 5.9354 8.5482 2.0592 6.8796 2.8086 32.9353 28.1471 7.9553 6.1478 4.3505 1.8268 2.0152 1.8380 11.5728 7.1026 0.9538 4.8760 0.5722 0.2132 0.8203 19.0537 9.0620 42.4359 125.7840 24.8826 0.6919 1.4674 8.2983 15.5355 21.4677 3.5665 6.5632 120.9175 93.5153 574.7490 85.4350 71.9090 61.6431 81.7481 45.7316 34.8722 44.9180 39.4577 21.9593 58.0241 74.5112 32.8394 15.5094 115.0260 65.9743 6.4514 19.7406 14.9297 19.2587 18.8894
temp: 298.150 k
press: 1.00000 atm
elementType: 7 7 7 7 6 6 6 6 6 6 6 6 6 1 1 1 1 1 1 1 1 1 1 1 1 1 1 1 1 1 1 1 1
symmnumber: 1
zpe: 771786.3 jmol-1
zpe.correction: 0.293958 hartree
zpe.thermalcorrener: 0.308678 hartree
zpe.thermalcorrenthalpy: 0.309622 hartree
zpe.thermalcorrgfe: 0.251008 hartree
zpe.sumelectzpe: -572.888734 hartree
zpe.sumelectthermal: -572.874014 hartree
zpe.sumelectthermalent: -572.873070 hartree
zpe.sumelectthermalfe: -572.931684 hartree
dipole: 2.2705 -1.3885 0.6099
dipole: 2.7304
quadrupole: -57.2561 -79.0056 -80.9361
quadrupole: -2.9006 5.4129 -2.3490
quadrupole: 15.1431 -6.6063 -8.5368 -2.9006 5.4129 -2.3490
hfenergy: -573.1826917 hartree
pointgroup: C01 [X(C9H20N4)]
dipole: -0.8849604 0.5600797 0.238977 debye
polarizability: 173.8749541|2.8211374|112.0543529|-4.5576283|5.1626048|98.4709209 unknown
InChI: InChI=1S/C9H20N4/c10-9(11)13-7-6-12-8-4-2-1-3-5-8/h8,12H,1-7,10-11H2
charge 0 multiplicity 1
33 atoms
N  0.474038 0.716976 0.007273
N  -3.132345 -0.210968 -0.551158
N  -5.372168 -0.910355 -0.414126
N  -4.725613 0.927883 0.895853
C  1.814093 0.177536 -0.337402
C  2.874529 1.286907 -0.143706
C  2.168045 -1.050724 0.537574
C  4.303019 0.778445 -0.449668
C  3.591671 -1.574998 0.23033
C  4.651643 -0.461674 0.40758
C  -0.682697 -0.090577 -0.443644
C  -2.004166 0.577288 -0.020519
C  -4.329318 -0.044709 -0.040029
H  1.855813 -0.149906 -1.411393
H  2.816351 1.640053 0.906158
H  2.63236 2.154264 -0.793324
H  1.427579 -1.858496 0.382049
H  2.094351 -0.742687 1.5999
H  5.03763 1.587691 -0.270953
H  4.376073 0.511086 -1.524339
H  3.629153 -1.950402 -0.813828
H  3.825461 -2.435936 0.886338
H  5.657133 -0.841274 0.139822
H  4.691618 -0.165448 1.47633
H  0.385333 1.687353 -0.333219
H  -0.636027 -1.090621 0.022931
H  -0.707726 -0.250372 -1.54879
H  -2.005496 0.668959 1.091669
H  -2.020009 1.617149 -0.429448
H  -5.091863 -1.653823 -1.052306
H  -6.314981 -0.535855 -0.514838
H  -5.519213 0.751537 1.508389
H  -4.060173 1.643402 1.174592
