program: Gaussian 09
title: 000274769
version: EM64L-G09RevD.01
frameworkgroup: C1[X(C16H23NO4)]
method: RPBEPBE
basis: SDD
operation: Freq
keyword: #p
keyword: freq=noraman
keyword: PBEPBE/SDD
title: #p freq=noraman PBEPBE/SDD
converged: YES YES NO NO
title: Mulliken charges:
elementType: O O O O N C C C C C C C C C C C C C C C C H H H H H H H H H H H H H H H H H H H H H H H
charge: -0.291422 -0.252666 -0.200388 -0.201530 0.027725 0.336131 -0.445188 -0.431165 -0.029337 -0.358651 -0.727701 -0.748811 -0.720367 -0.721343 0.210359 0.245521 -0.323111 -0.313689 -0.352194 -0.345000 0.388167 0.212257 0.210456 0.228828 0.204548 0.198919 0.220467 0.247243 0.214876 0.206685 0.227013 0.209900 0.222357 0.226000 0.213554 0.212246 0.210431 0.230212 0.210418 0.204236 0.282098 0.281062 0.291267 0.289588
chargesum: 0.00000
title: Mulliken charges with hydrogens summed into heavy atoms:
elementType: O O O O N C C C C C C C C C C C C C C C C
charge: -0.291422 -0.252666 -0.200388 -0.201530 0.027725 0.336131 -0.022475 0.002212 0.169582 0.109059 -0.079127 -0.090555 -0.084136 -0.076478 0.210359 0.245521 -0.041012 -0.032627 -0.060927 -0.055412 0.388167
polarizability: 2.69410357e+02 -2.41894934e+01 1.79244461e+02 1.94030274e+01 2.55479731e+01 1.57786402e+02
1716.lowfreq: -12.7662 -9.3770 -1.4290 -0.0009 -0.0008 -0.0007 10.9269 19.0587 31.2586
frequency: 9.7882 18.9927 31.0994 37.0288 57.3096 66.5424 75.9806 88.4927 115.3263 138.4245 149.4303 185.8201 198.9033 209.7687 219.8990 230.7198 236.2933 246.1328 251.5265 274.7566 286.6360 324.3818 345.7702 358.3971 369.9022 384.8072 409.8064 438.2783 456.7202 457.4631 487.0526 509.7016 531.5366 548.7880 623.4156 650.8174 675.6220 683.7666 746.8233 755.8224 762.8818 774.5910 791.9340 803.7650 864.8560 886.6837 889.6318 904.5699 908.0033 922.2094 935.8197 939.9112 955.0770 960.5262 991.8652 1004.6913 1005.3961 1012.5974 1020.2032 1025.5859 1062.1144 1089.6550 1094.6129 1109.2897 1121.4131 1173.2923 1176.2314 1191.6149 1192.2974 1211.8476 1214.1193 1243.0109 1254.5408 1281.9044 1287.9725 1292.6084 1303.7636 1328.4853 1341.0875 1350.8193 1367.6784 1368.8713 1375.2138 1378.7891 1392.7441 1396.9764 1405.6021 1413.4268 1455.3472 1460.5394 1465.7034 1467.6777 1470.0286 1474.8855 1476.5545 1477.0584 1480.0436 1484.2127 1490.1016 1493.7658 1589.3099 1609.2788 1619.8093 2953.8689 2966.9390 2968.4783 2972.5385 2973.9048 2976.0279 2977.0266 3012.9414 3020.1991 3038.7833 3060.2849 3063.7177 3064.5104 3067.7944 3069.1890 3069.7343 3077.2416 3081.6441 3093.9973 3165.3562 3176.1893 3188.1623 3193.7819
redmass: 4.7938 4.3455 3.1466 4.9521 7.6119 4.9215 5.4813 5.0443 3.1837 2.9863 2.6050 2.8112 1.1377 2.5977 1.3613 3.2448 1.1768 1.0831 4.0265 4.5649 5.0910 2.7813 2.5650 2.1608 2.2117 3.0032 2.8866 2.8958 2.5791 3.6817 8.8384 6.1513 2.3361 4.5190 7.1257 6.2712 7.5991 3.9425 3.9610 1.4209 4.9829 3.5897 3.2716 6.3526 1.2441 3.0683 1.7421 2.2919 1.2919 2.3538 1.3960 1.4070 1.9241 1.6209 1.5434 2.3003 1.6323 1.3675 1.7400 1.5742 4.2445 3.3001 1.5579 1.3256 1.8727 1.9862 1.3657 1.8694 1.8441 1.8822 6.6592 3.8875 1.5361 1.6508 1.6262 1.2629 1.2600 1.4555 1.4058 1.3821 7.5874 1.3759 1.2135 1.2046 1.2185 1.2087 8.3431 4.5343 1.0688 1.0938 1.0464 1.0562 1.0806 2.0594 1.0865 1.1058 1.0556 1.0512 1.0568 1.0642 8.6972 6.4379 9.4372 1.0753 1.0416 1.0440 1.0375 1.0418 1.0604 1.0429 1.0974 1.0587 1.1033 1.0996 1.0994 1.0994 1.0985 1.0986 1.0995 1.0996 1.0990 1.1072 1.0901 1.0891 1.0959 1.0974
irintensity: 0.0138 0.0775 0.0586 0.0240 0.3308 0.1809 0.8892 4.8470 1.9017 0.4761 0.7953 0.3141 0.5591 2.0772 0.3136 3.6007 0.7137 0.0327 2.3675 1.8007 4.6943 0.5655 4.9241 0.5511 0.4256 5.4548 0.0117 1.5487 1.5911 1.7499 7.9670 1.6764 2.4765 0.8854 0.3756 0.3320 2.2918 60.2514 20.0766 8.5051 3.4199 14.0122 2.9373 14.8402 0.6129 6.8599 54.6318 4.0050 1.1064 55.7477 0.8626 1.3404 2.0205 1.0595 1.4039 29.1832 11.6592 0.0539 0.3144 3.1420 259.3668 14.2455 17.2856 11.7963 1.0546 5.1250 4.5127 2.6619 4.2302 28.0039 485.6654 135.9414 6.7844 1.1791 30.9360 0.2479 0.8479 1.0141 2.6778 25.2424 80.5161 7.0964 22.4870 17.6817 14.9766 15.2888 8.8194 65.9950 2.4728 8.5679 1.5849 2.3175 14.1930 2.7304 3.4643 2.1158 13.9813 20.7335 8.4787 36.1716 50.7202 6.4785 103.5871 15.6282 21.5611 24.6706 12.0851 35.9901 68.9806 20.4606 0.1681 36.3947 67.7167 10.5462 21.8903 10.2356 142.5717 20.9467 56.7645 29.4578 51.4741 16.6562 1.0761 1.0991 0.4841 0.6762
temp: 298.150 k
press: 1.00000 atm
elementType: 8 8 8 8 7 6 6 6 6 6 6 6 6 6 6 6 6 6 6 6 6 1 1 1 1 1 1 1 1 1 1 1 1 1 1 1 1 1 1 1 1 1 1 1
symmnumber: 1
zpe: 953514.4 jmol-1
zpe.correction: 0.363174 hartree
zpe.thermalcorrener: 0.385793 hartree
zpe.thermalcorrenthalpy: 0.386737 hartree
zpe.thermalcorrgfe: 0.308346 hartree
zpe.sumelectzpe: -977.468176 hartree
zpe.sumelectthermal: -977.445557 hartree
zpe.sumelectthermalent: -977.444613 hartree
zpe.sumelectthermalfe: -977.523004 hartree
dipole: 5.1152 -1.7526 0.0817
dipole: 5.4077
quadrupole: -155.5016 -122.2889 -130.4491
quadrupole: -0.9837 -7.9937 0.5572
quadrupole: -19.4217 13.7910 5.6308 -0.9837 -7.9937 0.5572
hfenergy: -977.83135 hartree
pointgroup: C01 [X(C16H23N1O4)]
dipole: -1.999042 -0.6773829 0.2673953 debye
polarizability: 265.8147957|37.259951|151.4911565|6.8873029|-17.1023159|189.1352672 unknown
InChI: InChI=1S/C16H23NO4/c1-12(2)9-10-16(3,4)11-21-15(18)13-5-7-14(8-6-13)17(19)20/h5-8,12H,9-11H2,1-4H3
charge 0 multiplicity 1
44 atoms
O  -0.863043 -1.514284 0.482434
O  -0.628813 -0.992803 -1.787206
O  5.852847 1.334045 -0.271649
O  5.517478 0.813608 1.923519
N  5.130713 0.874213 0.69377
C  -3.279386 -1.16403 1.050263
C  -3.2922 0.313928 0.54321
C  -3.739044 0.538627 -0.920929
C  -3.648069 2.014752 -1.413919
C  -2.253971 -2.023618 0.271021
C  -2.919487 -1.168543 2.560051
C  -4.663437 -1.842428 0.856427
C  -4.557551 2.96925 -0.601858
C  -2.189859 2.534834 -1.453802
C  -0.169337 -1.024414 -0.61855
C  1.198626 -0.543341 -0.239655
C  2.028664 -0.028765 -1.269326
C  1.667638 -0.590404 1.098942
C  3.321232 0.438729 -0.971469
C  2.958872 -0.125936 1.411148
C  3.764656 0.381964 0.368393
H  -2.277077 0.732576 0.691604
H  -3.961333 0.881767 1.220072
H  -3.120618 -0.081233 -1.60021
H  -4.788705 0.202172 -1.040591
H  -4.022992 2.010636 -2.459802
H  -2.236262 -3.055029 0.665573
H  -2.458997 -2.037487 -0.813028
H  -3.680552 -0.613194 3.138675
H  -2.875077 -2.199966 2.959014
H  -1.938442 -0.692572 2.736201
H  -4.681461 -2.845459 1.323273
H  -5.452639 -1.233878 1.334986
H  -4.927932 -1.960008 -0.209895
H  -4.204404 3.073959 0.441188
H  -4.565861 3.980167 -1.050658
H  -5.601275 2.602235 -0.572695
H  -1.536356 1.842913 -2.017537
H  -2.14142 3.526979 -1.940395
H  -1.772252 2.647671 -0.435569
H  1.641424 -0.005481 -2.292472
H  1.015884 -0.992476 1.878252
H  3.983871 0.84033 -1.742095
H  3.350347 -0.148204 2.431191
