program: Gaussian 09
title: 000274690
version: EM64L-G09RevD.01
frameworkgroup: C1[X(C11H16N2O3)]
method: RPBEPBE
basis: SDD
operation: Freq
keyword: #p
keyword: freq=noraman
keyword: PBEPBE/SDD
title: #p freq=noraman PBEPBE/SDD
converged: YES YES NO NO
title: Mulliken charges:
elementType: O O O N N C C C C C C C C C C C H H H H H H H H H H H H H H H H
charge: -0.213012 -0.216913 -0.222790 -0.368421 -0.368155 -0.003329 -0.384503 0.358676 -0.369468 0.132986 0.119550 -0.818890 -0.263452 -0.701679 0.155462 -0.748381 0.212978 0.229778 0.217173 0.222135 0.228275 0.237727 0.256008 0.363549 0.365206 0.245558 0.215275 0.213241 0.219369 0.220934 0.233061 0.232050
chargesum: 0.00000
title: Mulliken charges with hydrogens summed into heavy atoms:
elementType: O O O N N C C C C C C C C C C C
charge: -0.213012 -0.216913 -0.222790 -0.004871 -0.002949 -0.003329 0.058253 0.358676 0.069840 0.132986 0.119550 -0.096879 -0.017894 -0.053794 0.155462 -0.062337
polarizability: 1.45544598e+02 7.02480791e+00 1.43150556e+02 6.86209281e+00 -8.30494946e+00 1.34257726e+02
1716.lowfreq: -16.8200 -8.6002 -0.0007 -0.0006 0.0003 9.2003 17.7107 43.5350 63.4909
frequency: 17.6375 43.4032 63.4557 87.4435 101.7621 103.8667 141.2203 155.1499 163.0818 166.1937 179.9383 233.5915 244.2365 264.7545 278.9285 298.4425 311.9163 354.8852 369.2480 372.8737 451.1837 486.8127 525.4635 531.7464 604.4059 625.9856 649.4687 668.0384 692.5994 732.6521 746.8929 749.3466 777.8595 838.4863 848.0012 872.6729 910.2928 959.6648 963.4735 994.1795 1019.0806 1037.9364 1043.7068 1048.7772 1093.9573 1102.2653 1116.9708 1145.5700 1162.8772 1198.1404 1261.1661 1286.4501 1302.9773 1309.6453 1354.1322 1360.8487 1371.2469 1375.1280 1376.3999 1390.8691 1395.1966 1407.3737 1444.1965 1462.5969 1463.0365 1471.0393 1472.2372 1478.8785 1480.7797 1484.1208 1612.2237 1648.1377 1672.4609 1676.5049 2972.9128 2976.4159 2981.7638 2986.2774 3014.3447 3035.2709 3041.6303 3059.4296 3070.8834 3076.8693 3084.1101 3093.3221 3107.0433 3119.1997 3520.2608 3523.1028
redmass: 3.1323 6.6142 2.1969 2.6249 1.3664 1.6764 4.2038 1.4573 10.2401 3.5427 3.2276 1.2040 3.0594 2.5019 3.5013 3.0381 3.7921 6.0580 4.3215 7.8004 3.9630 9.2959 3.6958 4.1042 5.9710 3.8496 2.3977 2.4208 4.3790 1.2043 3.1308 2.3743 1.7191 1.4861 1.8404 1.8767 1.7945 1.9605 2.0844 3.4637 1.8203 1.7087 1.5087 2.6068 2.3718 4.7631 2.4051 2.2530 2.9690 4.1058 1.3223 1.7228 1.9884 1.2328 1.4557 3.7366 1.5887 2.0398 1.5184 1.2083 1.2892 1.2138 1.0834 1.0559 1.0510 1.0477 1.0640 1.0425 1.0773 1.0675 6.8879 8.4226 6.1877 5.6313 1.0385 1.0354 1.0414 1.0592 1.0593 1.1004 1.0967 1.0932 1.1014 1.0993 1.1037 1.0955 1.0959 1.0911 1.0763 1.0777
irintensity: 0.0841 0.4070 0.0056 0.3932 0.3274 0.9262 0.9282 0.4002 8.9174 3.1407 0.4636 0.1778 0.5423 0.6510 4.2643 1.4954 1.3087 17.0999 9.1213 5.6279 7.8935 13.7519 41.8795 5.4803 1.7533 5.1218 1.7654 24.3803 10.5896 2.4695 5.2817 7.9166 201.9288 2.0103 7.7613 18.1339 5.2771 0.4324 9.2158 8.4156 13.5848 1.3928 0.2449 1.7556 27.0315 25.7174 7.5883 6.5129 19.5114 24.0976 9.7920 106.0498 181.0572 37.3581 11.0376 191.2025 17.3086 7.8674 15.7893 8.1871 4.7102 19.2682 16.7889 16.9710 7.5255 16.6946 1.7350 15.0679 24.1848 13.9400 262.3730 120.1135 4.9545 592.3234 34.0407 39.1442 15.8947 16.6819 20.9665 1.0887 18.2440 14.5219 14.8205 44.7757 42.7768 12.7751 17.1454 18.4045 77.0442 50.6944
temp: 298.150 k
press: 1.00000 atm
elementType: 8 8 8 7 7 6 6 6 6 6 6 6 6 6 6 6 1 1 1 1 1 1 1 1 1 1 1 1 1 1 1 1
symmnumber: 1
zpe: 680501.8 jmol-1
zpe.correction: 0.259189 hartree
zpe.thermalcorrener: 0.276454 hartree
zpe.thermalcorrenthalpy: 0.277398 hartree
zpe.thermalcorrgfe: 0.213449 hartree
zpe.sumelectzpe: -762.758147 hartree
zpe.sumelectthermal: -762.740883 hartree
zpe.sumelectthermalent: -762.739938 hartree
zpe.sumelectthermalfe: -762.803888 hartree
dipole: -0.3069 1.9785 0.4185
dipole: 2.0454
quadrupole: -101.0892 -94.1756 -101.1279
quadrupole: -7.5753 -1.0064 1.7278
quadrupole: -2.2917 4.6220 -2.3303 -7.5753 -1.0064 1.7278
hfenergy: -763.0173367 hartree
pointgroup: C01 [X(C11H16N2O3)]
dipole: -0.7409918 -0.2736623 0.1537336 debye
polarizability: 146.0769115|-7.9463188|138.6612084|4.5067125|9.890449|138.2147593 unknown
InChI: InChI=1S/C11H16N2O3/c1-4-6-11(7(3)5-2)8(14)12-10(16)13-9(11)15/h5,12-13H,4,6H2,1-3H3
charge 0 multiplicity 1
32 atoms
O  0.941808 0.225886 2.174744
O  -0.293598 0.89511 -2.388171
O  3.008191 -2.15476 -1.23052
N  1.863566 -1.038882 0.478249
N  1.276875 -0.679353 -1.776213
C  -0.234944 0.251875 -0.002364
C  -0.784612 1.669863 0.350682
C  -1.395251 -0.80958 0.171261
C  0.254203 2.812456 0.282905
C  0.893788 -0.143467 0.974556
C  0.237213 0.220529 -1.468258
C  -1.603956 -1.327473 1.584022
C  -2.183896 -1.142424 -0.890666
C  -0.384782 4.174639 0.630091
C  2.103042 -1.363007 -0.869163
C  -3.373828 -2.074983 -0.893807
H  -1.212368 1.6250 1.368929
H  -1.609719 1.876375 -0.354427
H  0.685428 2.863496 -0.73571
H  1.082216 2.608717 0.988326
H  -2.576618 -1.833287 1.683218
H  -0.820067 -2.052494 1.877365
H  -1.566192 -0.509342 2.324786
H  2.537285 -1.416739 1.152457
H  1.501518 -0.807917 -2.76811
H  -1.971736 -0.686732 -1.867261
H  -1.202095 4.420846 -0.073237
H  -0.807392 4.165705 1.652311
H  0.360291 4.989278 0.580509
H  -3.5701 -2.545809 0.082635
H  -4.288753 -1.532913 -1.203379
H  -3.222913 -2.884516 -1.634259
