program: Gaussian 09
title: 000274662
version: EM64L-G09RevD.01
frameworkgroup: C1[X(C11H21NO)]
method: RPBEPBE
basis: SDD
operation: Freq
keyword: #p
keyword: freq=noraman
keyword: PBEPBE/SDD
title: #p freq=noraman PBEPBE/SDD
converged: YES YES NO NO
title: Mulliken charges:
elementType: O N C C C C C C C C C C C H H H H H H H H H H H H H H H H H H H H H
charge: -0.269219 -0.613772 -0.313490 0.461613 -0.578364 -0.392199 -0.356841 -0.292874 0.204307 -0.706893 -0.463244 -0.689045 -0.668737 0.182306 0.208421 0.186477 0.236058 0.208240 0.215844 0.200933 0.245657 0.239405 0.218048 0.197769 0.206599 0.203281 0.206079 0.221524 0.212953 0.212097 0.220746 0.218397 0.309898 0.328026
chargesum: 0.00000
title: Mulliken charges with hydrogens summed into heavy atoms:
elementType: O N C C C C C C C C C C C
charge: -0.269219 0.024153 -0.131184 0.461613 -0.183466 0.052099 0.059936 -0.047217 0.204307 -0.051671 -0.053364 -0.048489 -0.017496
polarizability: 1.33806860e+02 -1.90006001e+00 1.42162356e+02 1.00443306e+00 -7.65619559e+00 1.16565322e+02
1716.lowfreq: -11.9195 -4.6847 -0.0005 -0.0002 0.0003 5.7550 22.7365 34.0902 48.1209
frequency: 22.2106 33.8927 48.0688 55.4283 72.0387 81.2899 101.5445 131.8404 161.9154 180.5171 201.9005 211.0867 222.7174 259.1599 285.0745 292.5315 336.6454 391.7382 441.5472 447.5134 492.2041 515.9565 586.3364 588.8458 629.4525 702.1981 742.9667 751.7939 773.8419 824.1929 861.5912 867.3904 881.0625 901.2595 926.0116 943.0475 1029.5359 1037.4255 1038.6910 1055.7088 1060.4103 1069.9739 1089.2071 1098.9448 1116.4379 1135.6621 1182.0891 1231.1882 1239.9040 1250.7762 1258.6567 1274.6374 1283.4794 1287.1750 1305.3293 1332.7127 1336.3380 1358.6303 1374.4154 1385.5423 1389.5276 1390.2401 1454.0344 1459.1320 1471.6713 1473.4574 1474.6422 1476.2774 1477.5419 1484.2192 1484.7195 1489.5791 1591.7776 1638.0700 1674.2185 2943.3572 2964.8643 2969.6004 2971.3106 2972.2740 2977.6723 2977.8837 2999.2817 3018.4579 3031.2273 3041.1883 3050.0915 3068.7251 3071.1672 3072.5642 3074.5188 3078.6472 3082.4213 3084.4430 3515.0404 3672.7680
redmass: 2.9026 2.7472 4.0367 3.0455 2.8959 1.8767 2.3774 2.8061 2.8288 2.3591 1.6540 1.3242 1.1425 1.8684 2.5372 2.8417 2.5039 2.8275 2.7246 2.6295 1.2317 2.1560 2.8093 2.2092 2.1119 2.3801 1.1812 1.6807 1.4896 1.8924 1.7305 1.6350 1.3927 1.5927 1.7576 2.2884 2.2323 1.7711 2.1046 2.2611 2.1746 1.6754 1.8814 1.9758 2.4273 2.3052 2.2041 1.3296 1.3767 1.2262 1.3206 1.2887 1.4792 1.1184 1.4246 1.4003 1.4453 2.0634 1.4465 1.2168 1.2256 1.2389 1.0820 1.0858 1.0607 1.0429 1.0471 1.0456 1.0537 1.0661 1.0525 1.0902 1.4894 3.1616 7.1067 1.0669 1.0648 1.0760 1.0360 1.0419 1.0603 1.0360 1.0614 1.0939 1.0947 1.0970 1.0989 1.1008 1.0993 1.0992 1.0985 1.0955 1.1010 1.0960 1.0446 1.1041
irintensity: 1.1649 0.2288 10.1610 3.9832 1.0508 0.6371 0.6835 0.4685 0.0305 1.6876 0.1035 1.3240 0.0730 0.0334 7.0508 1.3359 1.1830 1.1921 3.1206 0.9410 115.1737 74.1445 16.8795 37.5326 43.8587 29.0586 5.9787 4.6486 8.1312 0.7343 4.9064 6.1119 1.8809 23.4287 3.3086 7.4329 4.0390 0.9014 1.4487 1.0244 4.8790 4.1620 7.6629 8.2758 0.7816 0.5489 9.6936 6.9412 19.7388 1.6117 10.5054 0.3787 61.2128 0.8297 0.8797 2.7419 5.3431 76.9241 11.1035 15.5797 16.4841 7.0643 12.3773 4.5574 0.3940 11.9303 11.9701 12.6919 4.4803 13.8408 9.5230 13.8196 60.3279 228.5710 0.6064 26.5950 35.1927 21.3517 47.1092 58.0301 33.1167 33.6242 26.1844 4.1684 13.4994 23.6634 4.1653 68.6266 54.3032 42.6150 35.3033 30.5505 43.0870 56.7333 25.3921 19.4622
temp: 298.150 k
press: 1.00000 atm
elementType: 8 7 6 6 6 6 6 6 6 6 6 6 6 1 1 1 1 1 1 1 1 1 1 1 1 1 1 1 1 1 1 1 1 1
symmnumber: 1
zpe: 788735.6 jmol-1
zpe.correction: 0.300414 hartree
zpe.thermalcorrener: 0.317289 hartree
zpe.thermalcorrenthalpy: 0.318234 hartree
zpe.thermalcorrgfe: 0.254168 hartree
zpe.sumelectzpe: -560.688336 hartree
zpe.sumelectthermal: -560.671460 hartree
zpe.sumelectthermalent: -560.670516 hartree
zpe.sumelectthermalfe: -560.734581 hartree
dipole: -1.8389 -2.2837 2.4290
dipole: 3.8075
quadrupole: -86.7517 -83.9211 -73.4820
quadrupole: -5.5519 5.9510 -0.6085
quadrupole: -5.3668 -2.5362 7.9029 -5.5519 5.9510 -0.6085
hfenergy: -560.9887495 hartree
pointgroup: C01 [X(C11H21N1O1)]
dipole: 0.7833547 -0.8696148 -0.934921 debye
polarizability: 133.6202371|1.3607646|142.32688|1.1183413|7.6882523|116.5874211 unknown
InChI: InChI=1S/C11H21NO/c1-4-7-9(8-5-2)10(6-3)11(12)13/h7,10H,4-6,8,12H2,1-3H3
charge 0 multiplicity 1
34 atoms
O  -2.531924 1.275736 -0.21529
N  -1.986635 0.201244 -2.192521
C  -0.876633 -0.563435 -0.110814
C  0.513631 0.113368 -0.01894
C  1.665729 -0.67881 -0.621953
C  -1.435513 -0.974321 1.279975
C  2.029989 -1.957863 0.184249
C  0.637494 1.324886 0.596804
C  -1.872633 0.37953 -0.821862
C  -2.703729 -1.848993 1.191547
C  1.894932 2.142756 0.808757
C  3.16156 -2.770375 -0.480713
C  1.808892 3.531431 0.120658
H  -0.770601 -1.483398 -0.723097
H  2.571413 -0.050842 -0.712556
H  1.399539 -0.988958 -1.656322
H  -1.660333 -0.049248 1.841586
H  -0.639802 -1.508354 1.833715
H  2.327694 -1.660179 1.208504
H  1.131113 -2.596988 0.293531
H  -0.284578 1.798665 0.970092
H  -3.525875 -1.302472 0.695119
H  -3.053978 -2.136514 2.199713
H  -2.514102 -2.78051 0.623574
H  2.040606 2.300339 1.898017
H  2.792664 1.606299 0.450296
H  2.86949 -3.102862 -1.495225
H  3.413532 -3.67017 0.109866
H  4.08119 -2.163265 -0.580112
H  2.709234 4.137074 0.333881
H  0.925873 4.093177 0.477092
H  1.715091 3.421475 -0.974786
H  -1.460245 -0.514207 -2.689962
H  -2.589886 0.833484 -2.718627
