program: Gaussian 09
title: 000274651
version: EM64L-G09RevD.01
frameworkgroup: C1[X(C11H7NO5)]
method: RPBEPBE
basis: SDD
operation: Freq
keyword: #p
keyword: freq=noraman
keyword: PBEPBE/SDD
title: #p freq=noraman PBEPBE/SDD
converged: YES YES NO NO
title: Mulliken charges:
elementType: O O O O O N C C C C C C C C C C C H H H H H H H
charge: -0.201860 -0.184535 -0.393047 -0.224046 -0.153021 -0.263052 0.182227 0.202101 -0.175370 0.104375 0.141771 -0.350699 -0.351058 0.188221 -0.209035 -0.208283 -0.063233 0.311172 0.270795 0.271270 0.229050 0.241385 0.241352 0.393520
chargesum: 0.00000
title: Mulliken charges with hydrogens summed into heavy atoms:
elementType: O O O O O N C C C C C C C C C C C
charge: -0.201860 -0.184535 0.000473 -0.224046 -0.153021 -0.263052 0.182227 0.202101 0.135802 0.104375 0.141771 -0.079904 -0.079788 0.188221 0.032350 0.033069 0.165817
polarizability: 1.93634449e+02 8.63538529e-01 1.35257047e+02 -4.06892500e+00 -2.54451938e+00 8.73214242e+01
1716.lowfreq: -5.2190 -4.2137 0.0007 0.0008 0.0010 4.1308 39.3359 49.9258 62.7385
frequency: 39.3333 49.9086 62.7318 93.8121 127.7804 128.0654 145.3471 161.0359 187.1704 239.5363 298.8837 331.0152 345.2041 372.3689 417.7843 455.7784 463.7408 522.4090 535.6606 582.4679 605.5765 628.7827 658.7678 674.1193 687.1630 716.5366 720.6769 789.5019 797.8361 835.0342 859.4391 908.2884 918.1551 971.8682 976.1168 1008.0914 1008.3673 1036.3750 1073.2563 1077.4351 1100.3878 1171.5371 1173.5232 1205.9058 1216.8859 1285.2037 1298.2335 1314.3171 1352.2026 1376.2121 1417.4651 1454.3174 1455.0699 1613.3331 1619.7694 1635.9468 1645.3653 1661.2082 1686.2328 2937.7617 2965.7146 3142.1316 3155.3349 3166.6803 3176.5627 3519.4633
redmass: 8.2448 9.5378 7.9591 8.5760 4.3465 5.4674 5.1441 7.8277 6.9437 6.9642 9.1074 6.9894 7.9483 7.1002 3.4576 4.8527 4.1077 7.1836 7.2755 3.4143 2.1634 3.5889 4.8271 3.8427 6.7673 3.6634 3.1796 5.1114 1.7230 3.8599 5.5885 1.4078 4.9794 2.8932 1.4138 1.3557 2.4956 2.4604 2.6528 2.2020 5.3863 1.2459 1.7458 1.3672 3.6362 1.4858 1.5119 2.3373 1.7350 3.0899 5.9430 2.8501 2.4789 7.6106 7.6988 12.4851 10.1284 9.5663 11.8773 1.0786 1.0903 1.0866 1.0907 1.0957 1.1005 1.0643
irintensity: 0.9301 2.0404 1.2925 2.1481 8.9646 6.0289 1.9569 2.9733 1.2811 0.5296 11.4621 5.4103 7.6259 1.5405 4.6345 0.0941 28.8794 11.7566 26.1488 38.6240 73.9769 52.6004 0.1656 24.3820 0.6421 35.9156 89.6273 0.0935 27.4491 19.3179 17.5518 0.0263 16.8353 21.6877 1.6139 0.0498 5.8908 22.2834 15.6462 188.4270 86.9741 6.6299 8.7822 26.3987 40.5708 1.3227 27.0709 72.3079 128.1504 205.2252 4.3146 0.3243 13.3097 1.2604 40.1344 399.3294 245.0552 158.3730 82.3451 29.2364 48.0675 1.6165 4.5393 4.7254 19.0108 42.9666
temp: 298.150 k
press: 1.00000 atm
elementType: 8 8 8 8 8 7 6 6 6 6 6 6 6 6 6 6 6 1 1 1 1 1 1 1
symmnumber: 1
zpe: 426218.6 jmol-1
zpe.correction: 0.162338 hartree
zpe.thermalcorrener: 0.176730 hartree
zpe.thermalcorrenthalpy: 0.177674 hartree
zpe.thermalcorrgfe: 0.119852 hartree
zpe.sumelectzpe: -853.065499 hartree
zpe.sumelectthermal: -853.051107 hartree
zpe.sumelectthermalent: -853.050163 hartree
zpe.sumelectthermalfe: -853.107985 hartree
dipole: 3.6959 -0.3155 -2.8953
dipole: 4.7056
quadrupole: -79.9242 -101.7281 -98.7378
quadrupole: -3.8475 3.3737 3.3785
quadrupole: 13.5391 -8.2647 -5.2744 -3.8475 3.3737 3.3785
hfenergy: -853.2278368 hartree
pointgroup: C01 [X(C11H7N1O5)]
dipole: 1.5053991 -0.135352 -1.0690167 debye
dipolederiv: -0.6186423 0.2077511 -0.0188521 0.0758892 -1.059636 0.0821304 0.0003341 0.0866909 -0.3226731 -0.6961691 -0.2865683 0.039107 -0.1670339 -0.8893376 0.0682259 0.0305055 0.0608359 -0.3163597 -0.5240474 0.1229983 0.3759521 0.1475177 -0.3469526 -0.2098544 0.3052547 -0.124831 -0.9769489 -1.1466435 -0.0122527 0.0505088 -0.2018249 -0.3477606 -0.1153543 -0.1909519 -0.0874649 -0.543122 -0.381497 -0.0296905 -0.2115766 0.0153926 -0.2596146 0.0189463 0.1041521 -0.0101942 -0.9338486 -1.1090212 -0.0778534 0.0195682 0.0001575 -1.1500019 0.0972104 0.033849 0.1001481 -0.2718197 -0.4177006 0.2084879 -0.0179782 0.2524059 -0.1295667 0.0113697 -0.0200474 0.0136195 0.0000626 -0.4853947 -0.1451176 0.0246329 -0.1594106 -0.0369661 0.0060269 0.0307698 0.0018809 -0.0105186 0.4494035 -0.0800649 0.0629219 -0.336463 0.0224105 0.0561547 0.0718995 -0.0128678 -0.4409811 1.3220788 0.0576954 -0.0140384 0.1485363 1.4940511 -0.1421116 -0.0529329 -0.1513765 0.250205 1.3020333 0.0325459 -0.007314 -0.0817622 1.3907163 -0.1334181 -0.0296809 -0.1173195 0.2816283 -0.0886999 -0.060621 0.0084905 0.1309917 0.1346081 -0.0284158 -0.0141899 -0.0233273 -0.0882112 -0.105342 0.1148649 -0.0128987 -0.0795894 0.1298426 -0.0258615 0.0106473 -0.0305752 -0.0873565 1.4514857 0.0250326 -0.1211792 0.2018766 0.3569449 0.5300809 0.040272 0.3368026 1.3078595 0.148717 0.0883506 -0.01498 0.0558997 -0.0638679 -0.0089254 -0.0101605 -0.0096688 -0.1367482 0.1106326 -0.1328218 0.0120668 -0.0920083 -0.0194547 -0.0127198 0.0077685 -0.0123117 -0.1330478 0.5476786 0.1114609 -0.0938983 0.1063443 0.1679665 -0.2010832 -0.2853521 -0.0615491 1.3059065 0.1553718 -0.0325365 -0.0114714 0.1493719 0.1075322 -0.0259829 -0.0247137 0.0043123 0.1297324 0.1023719 0.0093492 -0.0002193 -0.0338257 -0.0194033 0.0215329 0.0049734 0.0203948 0.1554961 0.1014276 -0.0365305 0.0049757 0.0053883 -0.0161035 0.020196 0.0008501 0.0208456 0.1535559 -0.1496488 -0.0386238 0.0239486 -0.0949552 0.0988994 0.0356219 0.0193636 0.0012348 0.0436039 -0.0816667 -0.0599787 0.0107468 -0.0651539 0.0698867 0.0113828 0.0117 0.0112895 0.1559093 -0.0459445 0.0848167 -0.0069434 0.0926024 0.0342579 0.013228 -0.0077822 0.0132118 0.1560015 0.1592171 -0.0706938 -0.1015696 -0.0703468 0.3315494 -0.0683799 -0.0365283 -0.0297805 0.3216743 unknown
polarizability: 193.7169312|2.2604714|135.0441731|0.6103371|-4.4378986|87.4518159 unknown
InChI: InChI=1S/C11H7NO5/c13-5-8(11(16)17)12-9(14)6-3-1-2-4-7(6)10(12)15/h1-5,8,16H
charge 0 multiplicity 1
24 atoms
O  0.061726 2.56111 -0.204677
O  -0.479283 -2.07674 0.342066
O  -1.911744 -0.535206 -2.112534
O  -3.971136 -0.373052 -1.039109
O  -1.934006 0.028814 2.524683
N  -0.532402 0.280542 0.066873
C  1.745082 0.722425 -0.02187
C  1.580646 -0.676245 0.145458
C  -1.965703 0.462253 0.10158
C  0.393389 1.358177 -0.071539
C  0.117997 -0.983521 0.207498
C  3.018128 1.304573 -0.111254
C  2.685035 -1.536645 0.228934
C  -2.734718 -0.194353 -1.049383
C  4.14162 0.441471 -0.027837
C  3.977515 -0.956962 0.139952
C  -2.587188 0.035648 1.466219
H  -2.140101 1.56059 0.016677
H  3.133213 2.385349 -0.238533
H  2.547448 -2.614309 0.360364
H  -3.667804 -0.225521 1.407361
H  5.151687 0.859616 -0.092287
H  4.863415 -1.597685 0.202872
H  -2.449615 -0.970231 -2.828515
