program: Gaussian 09
title: 000274634
version: EM64L-G09RevD.01
frameworkgroup: C1[X(C10H7NO5S)]
method: RPBEPBE
basis: SDD
operation: Freq
keyword: #p
keyword: freq=noraman
keyword: PBEPBE/SDD
title: #p freq=noraman PBEPBE/SDD
converged: NO NO NO NO
title: Mulliken charges:
elementType: S O O O O O N C C C C C C C C C C H H H H H H H
charge: 1.010310 -0.544915 -0.507090 -0.502644 -0.433225 -0.240807 -0.215098 0.313425 0.234448 -0.269218 0.175001 -0.354592 -0.245335 -0.225507 -0.243039 -0.325617 0.144140 0.309152 0.294051 0.253303 0.289260 0.268742 0.415390 0.399865
chargesum: 0.00000
title: Mulliken charges with hydrogens summed into heavy atoms:
elementType: S O O O O O N C C C C C C C C C C
charge: 1.010310 -0.129525 -0.507090 -0.502644 -0.033360 -0.240807 -0.215098 0.313425 0.234448 -0.269218 0.175001 -0.045440 0.048715 0.027796 0.046221 -0.056875 0.144140
polarizability: 2.21148174e+02 1.20096192e+01 1.81717478e+02 -1.96932577e+00 -1.47246792e+00 7.83206679e+01
1716.lowfreq: -5.8377 -0.0013 0.0015 0.0018 2.7019 7.4057 39.5675 46.8932 55.2591
frequency: 39.5373 46.8221 55.2574 114.6843 146.7791 183.1367 192.1798 206.7520 214.5010 248.4464 255.7299 309.7810 334.0991 345.2221 386.3349 425.0032 453.7188 463.3159 505.2747 531.6242 555.1906 569.8651 592.5424 606.5317 610.0607 645.5219 737.7123 742.6054 781.6309 803.2387 831.0501 841.2660 851.7178 876.8645 896.6532 951.8966 970.7143 977.1569 990.0139 1014.7526 1056.1632 1069.1544 1101.4603 1169.0950 1199.2946 1219.5591 1222.7405 1313.0687 1331.7362 1352.2471 1379.6685 1384.3358 1426.0720 1443.1381 1498.7616 1555.5697 1568.5017 1610.5682 1636.9944 2596.4884 3149.6656 3159.6558 3165.4838 3190.2851 3200.5914 3525.7487
redmass: 10.2507 11.0944 8.9013 8.4343 7.8415 4.2859 8.5088 10.3849 6.7738 7.5693 5.5963 8.3478 9.5472 9.0212 9.1523 12.4478 5.3349 3.0783 6.4396 7.0685 4.4453 7.3807 5.5391 1.9925 4.9354 2.2343 6.8448 5.8633 1.8757 5.5431 2.5288 3.1985 10.7537 1.4761 1.2755 1.3856 10.6933 8.9726 1.4363 1.3520 2.5007 2.6452 2.1299 1.4942 1.7899 1.7077 2.0058 2.1851 2.3214 3.5916 1.4793 2.0112 3.6614 2.4158 4.3443 6.6882 7.3039 6.7636 8.8148 1.0696 1.0893 1.0922 1.0942 1.0963 1.0951 1.0644
irintensity: 0.9318 3.6174 2.4336 0.3047 2.4877 4.6125 0.5397 2.8724 11.7222 7.1542 5.3080 10.4824 3.6537 10.0943 5.8693 54.8954 13.0003 0.0514 16.2739 8.5056 4.5411 5.9977 100.7541 68.5992 77.2997 50.3786 11.4665 15.0437 25.0633 1.1264 49.5655 58.4737 71.7030 111.6986 80.2726 0.9291 67.0747 133.7206 1.6201 2.0740 1.3513 310.7956 1.1070 16.8794 10.7086 2.9970 20.8935 88.5095 110.7890 11.1008 128.1677 2.3772 13.5603 4.0045 62.8373 10.8695 28.5757 0.0385 157.3081 753.6447 3.6153 6.4708 9.5846 10.4088 1.2556 78.8392
temp: 298.150 k
press: 1.00000 atm
elementType: 16 8 8 8 8 8 7 6 6 6 6 6 6 6 6 6 6 1 1 1 1 1 1 1
symmnumber: 1
zpe: 411702.2 jmol-1
zpe.correction: 0.156809 hartree
zpe.thermalcorrener: 0.171506 hartree
zpe.thermalcorrenthalpy: 0.172451 hartree
zpe.thermalcorrgfe: 0.114304 hartree
zpe.sumelectzpe: -1212.819806 hartree
zpe.sumelectthermal: -1212.805108 hartree
zpe.sumelectthermalent: -1212.804164 hartree
zpe.sumelectthermalfe: -1212.862311 hartree
dipole: -10.1141 0.1822 -0.4532
dipole: 10.1259
quadrupole: -120.4100 -92.3812 -113.4962
quadrupole: 12.5383 -0.5413 0.9180
quadrupole: -11.6475 16.3812 -4.7337 12.5383 -0.5413 0.9180
hfenergy: -1212.9766146 hartree
pointgroup: C01 [X(C10H7N1O5S1)]
dipole: 3.9762588 -0.0466047 -0.2411453 debye
dipolederiv: 2.056234 -0.0150143 -0.0981987 -0.0708382 1.2373945 -0.0063532 -0.2031455 -0.0018274 1.4215638 -0.9795715 -0.0945843 0.1784381 -0.0560853 -0.7076563 0.1783085 0.0268096 0.131863 -0.6146415 -0.7643242 -0.0379003 -0.0107068 -0.123112 -0.4843452 -0.0734924 -0.0500932 -0.0771888 -0.476403 -0.6896475 0.0272603 -0.0134074 0.1164781 -0.468933 -0.0916382 0.1435292 -0.0746011 -0.6442549 -1.1425438 -0.4998361 0.0814438 -0.5973939 -0.6269648 0.028793 0.0889603 0.0272294 -0.4189775 -0.8348351 0.1869827 -0.0372868 0.065081 -0.7945229 0.0842281 -0.0223938 0.0910447 -0.3219968 -0.5707213 0.0197445 -0.006375 0.14703 -0.1313463 0.0147014 -0.1638467 -0.0274334 -0.1584558 -0.2756068 -0.187845 0.0378044 0.2575148 0.0677106 0.0139035 -0.0372823 0.011936 0.0692443 0.0071948 0.3394908 -0.0612619 0.1898084 -0.1150106 0.0077231 -0.0403908 0.0116535 0.0727855 -0.024084 -0.050798 -0.0125483 -0.1443618 -0.1085996 0.0020687 0.0369155 -0.0344873 -0.2178023 -0.3802228 0.1373054 -0.0295218 0.2943027 0.1307941 -0.0217024 -0.0678436 -0.0186888 0.0382597 -0.07728 -0.0633049 0.0216445 -0.1146697 -0.0477303 -0.0119498 0.0256853 -0.0146625 -0.1130537 -0.0765626 0.2274953 -0.0223014 -0.0435047 -0.1230817 -0.0089133 0.018762 0.0301962 -0.0543757 -0.0473343 -0.1759827 0.0279948 -0.0155371 0.205046 -0.0524098 -0.0106818 -0.0474857 -0.1019238 0.0127055 0.2791418 -0.0538527 -0.1118363 -0.3018679 0.0497264 0.0430674 0.0704799 -0.0773991 0.0727524 -0.3673003 0.0766011 -0.0269477 0.3451944 -0.0853669 0.0136867 -0.0857268 -0.0096865 1.9889036 0.135852 -0.0035205 0.1441879 1.175579 -0.1584106 0.0061022 -0.1671155 0.264992 0.1423371 0.0701253 -0.012718 0.0268188 0.1138908 0.0092433 0.0000905 0.0060882 0.1607958 0.0747382 -0.0526946 0.008482 -0.0202964 0.1240796 0.0064691 0.0174396 -0.0053219 0.1466071 0.0578958 0.0192204 -0.0027992 0.0249535 -0.060383 0.034427 -0.0065075 0.0378174 0.1514551 0.0826301 -0.0458341 0.0076042 -0.0570714 0.0942435 0.0124968 0.0104067 0.0123694 0.1585513 0.0752972 0.0202613 -0.0074772 -0.0060198 -0.0334288 0.0377113 -0.009503 0.0370572 0.1298031 0.9655248 0.0285088 -0.0479057 -0.0476108 0.2739893 -0.0024239 0.2104161 0.0543132 0.1941763 0.3265205 0.0997059 -0.0201314 0.16911 0.2359485 0.0328601 -0.0301829 0.0324912 0.4007368 unknown
polarizability: 220.7370028|12.4188039|179.1062443|-2.7983727|-17.5749334|81.3430727 unknown
InChI: InChI=1S/C10H7NO5S/c12-10(13)7-4-5-11-9-6(7)2-1-3-8(9)17(14,15)16/h1-5,12,14H
charge 0 multiplicity 1
24 atoms
S  -3.336207 0.058878 0.045267
O  -3.135022 1.321187 -1.229712
O  -4.390854 -1.046672 -0.466163
O  -3.523219 0.742289 1.496095
O  4.353331 0.853026 -0.257658
O  3.777261 -1.356336 0.120758
N  -0.607013 1.427766 -0.480731
C  0.866836 -0.538647 -0.055632
C  -0.440904 0.082449 -0.175522
C  -1.601822 -0.733842 -0.007537
C  2.011003 0.334533 -0.208423
C  0.932465 -1.949686 0.195898
C  -1.524952 -2.101748 0.217141
C  -0.235104 -2.708217 0.309792
C  1.8054 1.697723 -0.47473
C  0.482566 2.203101 -0.617422
C  3.416956 -0.174896 -0.095314
H  1.912499 -2.421641 0.287793
H  -2.441963 -2.693202 0.312158
H  -0.16597 -3.786067 0.486737
H  2.661427 2.364938 -0.589116
H  0.310716 3.256774 -0.857061
H  -2.165509 1.669445 -1.010168
H  5.270382 0.475746 -0.172154
