program: Gaussian 09
title: 000274622
version: EM64L-G09RevD.01
frameworkgroup: C1[X(C9H12O4)]
method: RPBEPBE
basis: SDD
operation: Freq
keyword: #pfreq=noraman
keyword: PBEPBE/SDD
title: #p freq=noraman PBEPBE/SDD
converged: YES YES NO NO
title: Mulliken charges:
elementType: O O O O C C C C C C C C C H H H H H H H H H H H H
charge: -0.420016 -0.422902 -0.221434 -0.210175 0.150876 -0.102766 -0.510296 -0.469959 -0.752476 -0.194098 -0.207400 0.146651 0.119017 0.244199 0.259996 0.249775 0.254844 0.209348 0.208606 0.223840 0.260644 0.208168 0.206999 0.383309 0.385250
chargesum: 0.00000
title: Mulliken charges with hydrogens summed into heavy atoms:
elementType: O O O O C C C C C C C C C
charge: -0.036707 -0.037652 -0.221434 -0.210175 0.150876 0.141433 -0.000525 -0.005767 -0.059386 0.014070 -0.000400 0.146651 0.119017
polarizability: 1.09818443e+02 3.44761168e+00 9.64566360e+01 -3.79393874e+00 -5.95128026e+00 1.01000877e+02
1716.lowfreq: -9.4810 -0.0010 -0.0008 -0.0004 8.1261 15.3017 47.4670 81.1862 103.7910
frequency: 47.3936 81.1658 103.7848 138.4485 151.6996 172.7625 202.4495 220.7792 281.7964 301.3796 346.6321 377.8439 387.2940 406.9472 450.0643 503.9719 522.0625 579.9779 590.8999 610.5566 659.1130 675.9643 692.5513 702.0252 772.4496 842.9929 890.9161 911.4645 936.7621 970.5062 977.2532 993.3689 1016.9936 1048.7759 1053.1538 1083.6471 1108.7864 1119.1765 1150.8037 1188.4055 1219.0968 1244.4324 1281.3059 1290.9189 1301.2630 1323.5169 1344.4618 1349.6074 1375.5948 1396.9528 1452.2544 1466.6291 1477.1359 1487.1601 1643.4949 1660.8261 1675.7686 2972.4106 2985.5786 2992.2230 3004.1279 3022.9313 3061.0008 3070.7884 3101.6976 3102.3007 3133.4591 3513.8609 3518.7320
redmass: 9.6639 7.8055 4.1721 3.3083 5.2707 3.1616 2.8179 1.3086 3.8698 2.9955 3.7628 7.3522 2.9126 2.8300 3.7326 3.1152 2.8788 1.4234 1.7357 2.5137 2.4020 1.4697 4.1121 4.8408 4.3231 2.5108 1.9576 1.7336 2.6799 1.4995 1.8586 3.7256 1.9127 2.5431 2.2565 3.0714 1.7454 2.3041 1.9914 1.0880 1.3588 1.3932 2.0186 2.1433 1.3972 1.4622 1.5659 1.4386 1.6224 1.2018 1.0885 1.0887 1.0452 1.0543 9.5098 9.0326 6.4026 1.0604 1.0408 1.0812 1.0612 1.0974 1.0995 1.0987 1.0983 1.0852 1.0995 1.0641 1.0641
irintensity: 0.7724 1.0925 0.3375 0.9711 0.5113 0.9082 1.2950 0.4807 3.2469 4.9137 1.7767 2.2009 0.1484 0.1144 0.7126 5.8347 16.1358 92.8217 93.7449 101.7374 57.0383 31.6571 49.4640 17.1459 1.3824 11.0598 0.8237 12.6434 4.0486 40.3836 65.1166 71.6339 13.5285 96.2809 65.3466 97.3365 68.5696 41.9172 4.9640 3.3218 0.1200 3.5426 22.2053 28.5609 11.5043 1.1061 4.0808 2.4155 1.4700 22.1684 16.0717 14.2463 13.2346 7.9929 208.8700 191.1755 5.5358 23.7474 31.8785 5.5618 10.7269 20.4932 6.3696 33.1903 13.8412 6.3975 54.1369 30.6065 30.1250
temp: 298.150 k
press: 1.00000 atm
elementType: 8 8 8 8 6 6 6 6 6 6 6 6 6 1 1 1 1 1 1 1 1 1 1 1 1
symmnumber: 1
zpe: 518835.7 jmol-1
zpe.correction: 0.197614 hartree
zpe.thermalcorrener: 0.210400 hartree
zpe.thermalcorrenthalpy: 0.211344 hartree
zpe.thermalcorrgfe: 0.158966 hartree
zpe.sumelectzpe: -650.055720 hartree
zpe.sumelectthermal: -650.042934 hartree
zpe.sumelectthermalent: -650.041990 hartree
zpe.sumelectthermalfe: -650.094368 hartree
dipole: -0.6509 -0.5884 -2.0687
dipole: 2.2471
quadrupole: -75.0267 -68.5534 -79.7393
quadrupole: -2.4705 -4.0824 0.3002
quadrupole: -0.5869 5.8864 -5.2995 -2.4705 -4.0824 0.3002
hfenergy: -650.2533341 hartree
pointgroup: C01 [X(C9H12O4)]
dipole: 0.3104339 0.6441444 -0.5198905 debye
dipolederiv: -0.5148789 -0.1573688 -0.2558048 -0.2038405 -0.5341412 -0.4357296 -0.2544863 -0.3807579 -0.8082534 -0.3224732 0.1964777 -0.0913455 0.1280666 -1.1281228 0.2467381 -0.0585917 0.2029414 -0.4390879 -0.3629344 -0.0513748 -0.1657365 0.0602817 -0.6804893 0.2740308 -0.2059826 -0.0302631 -0.7564047 -0.9150262 -0.2311583 0.1514261 -0.0140041 -0.6440459 0.1071303 0.1232413 0.1601106 -0.3334584 -0.3561969 0.0874541 -0.0212887 -0.0254672 -0.1197304 0.0404911 -0.0373204 0.0769089 -0.0761505 0.1538764 0.0498214 0.0289091 0.1410867 0.0978548 0.0650855 0.1105587 0.0342655 0.1413486 0.0054793 0.0467619 -0.0278846 0.1664135 0.0804946 0.0263068 -0.110019 -0.0303718 0.0610259 -0.0262991 0.0586656 0.0162299 -0.0069875 0.1790443 0.0216189 0.0129345 -0.0111326 -0.1153676 0.0207201 -0.0165961 0.0531849 -0.0049826 0.0365216 -0.0264182 0.0355494 0.0020017 -0.0828387 0.1478077 -0.0605676 -0.0220849 -0.1182341 -0.2269288 -0.0020055 0.0002649 0.0156785 -0.0182824 0.0460165 -0.0564112 -0.0478907 -0.0642853 -0.225733 0.0135581 -0.0361612 0.0201643 0.1904922 0.4192496 0.1402559 0.444412 0.1301683 1.1444481 0.0554158 0.4769144 0.2074941 1.1586578 1.3062863 -0.0606671 -0.1017553 -0.1720655 1.3149818 -0.3803482 -0.1370031 -0.3715134 0.3160961 0.0347483 -0.0151824 -0.0025214 -0.0107849 -0.1046938 0.0410692 -0.0034969 0.0603115 0.0059479 0.0447014 0.0123771 -0.0270719 0.0316128 -0.0652808 0.0586086 0.0150752 0.0363715 0.0989884 0.0119908 -0.0185681 -0.0559814 -0.0507467 0.079837 -0.0878816 -0.0200109 -0.0699901 -0.0299728 0.1143116 0.0109323 0.0684732 0.0507664 -0.0288901 0.0753072 -0.0053498 0.0710098 0.0046446 -0.0420362 -0.0693201 -0.0481565 -0.0822732 0.0008896 -0.1260318 -0.0783088 -0.07597 -0.0140017 -0.0015045 -0.0865594 -0.1291728 -0.0694452 0.0334719 -0.095307 -0.0745157 -0.0758499 -0.0481029 -0.1260147 0.1035152 0.0564359 0.0931291 0.0400191 -0.0052836 0.0016807 0.0189125 0.0641377 0.0802163 -0.0041322 0.004297 -0.0185953 -0.042345 0.0978682 0.0193811 0.0347074 0.1020225 -0.0264936 0.0170875 0.0887002 0.0233325 0.1619499 -0.0315864 0.104198 -0.018134 -0.1000359 -0.165127 0.0561336 0.0488315 0.0632428 0.1362367 -0.016847 0.0380851 -0.0159176 0.0392914 0.3675622 0.0262328 -0.0179832 0.0030524 0.1555873 0.0777397 -0.0055618 0.1398061 0.2852713 0.1060181 0.022191 0.0537786 -0.0494406 0.3390642 0.0064705 0.088925 -0.0007833 0.3540322 unknown
polarizability: 110.0367762|-1.4463883|92.4862202|4.8539518|-1.0640286|104.7529597 unknown
InChI: InChI=1S/C9H12O4/c1-6-4-2-3-5-9(6,7(10)11)8(12)13/h2-3,6,10,12H,4-5H2,1H3
charge 0 multiplicity 1
25 atoms
O  -0.866788 -2.023555 -1.136684
O  -1.767279 1.971923 -0.506882
O  0.062676 -2.08762 0.977617
O  -2.683217 0.004098 0.30107
C  -0.241228 0.11475 -0.183711
C  0.608654 0.803744 0.957639
C  0.408575 0.467454 -1.563921
C  2.055992 0.245525 0.961887
C  -0.026724 0.729072 2.362471
C  1.900957 0.195418 -1.560979
C  2.639981 0.083836 -0.426343
C  -0.308946 -1.417082 -0.00697
C  -1.682698 0.630638 -0.106409
H  0.658705 1.868547 0.653459
H  0.208057 1.534354 -1.7773
H  -0.084633 -0.117201 -2.360444
H  2.081909 -0.723481 1.498912
H  2.689998 0.939693 1.550424
H  0.619482 1.255258 3.089324
H  -1.021275 1.21011 2.395551
H  -0.136553 -0.31732 2.692047
H  2.382075 0.085096 -2.541756
H  3.71351 -0.137602 -0.497028
H  -0.953891 -3.001319 -0.972793
H  -2.707538 2.280865 -0.398782
