program: Gaussian 09
title: 000274648
version: EM64L-G09RevD.01
frameworkgroup: C1[X(C20H17NO)]
method: RPBEPBE
basis: SDD
operation: Freq
keyword: #p
keyword: freq=noraman
keyword: PBEPBE/SDD
title: #p freq=noraman PBEPBE/SDD
converged: YES YES NO NO
title: Mulliken charges:
elementType: O N C C C C C C C C C C C C C C C C C C C C H H H H H H H H H H H H H H H H H
charge: -0.252872 -0.454956 0.334756 0.344200 -0.564267 0.529506 -0.526340 -0.636650 0.255225 0.247233 -0.383311 -0.383303 -0.385457 -0.385469 -0.222157 -0.222153 -0.222176 -0.222173 -0.240325 -0.240222 0.207978 -0.800783 0.267597 0.327028 0.240213 0.241947 0.241949 0.244628 0.244625 0.311705 0.225498 0.225499 0.227053 0.227052 0.227414 0.229112 0.236446 0.269511 0.236438
chargesum: 0.00000
title: Mulliken charges with hydrogens summed into heavy atoms:
elementType: O N C C C C C C C C C C C C C C C C C C C C
charge: -0.252872 -0.143252 0.334756 0.344200 -0.296670 0.529506 -0.199313 -0.396437 0.255225 0.247233 -0.141364 -0.141354 -0.140830 -0.140844 0.003342 0.003346 0.004878 0.004879 -0.012910 -0.011110 0.207978 -0.058388
polarizability: 2.81935615e+02 2.82579492e+00 2.32211909e+02 -2.36604794e-03 -1.19853423e-02 1.74067510e+02
1716.lowfreq: -88.9923 -51.5462 -46.2987 -5.5473 -0.0008 -0.0007 -0.0004 3.7426 4.5132
frequency: -88.9912 -51.5366 -46.2872 38.8748 43.7199 52.1426 62.3191 90.2243 102.9786 149.4665 222.4607 226.5514 241.7999 254.4484 282.8827 321.4903 334.0250 350.1720 382.6537 397.4482 398.3742 517.8553 523.8193 567.8641 568.0354 601.2362 608.5902 613.2773 622.7941 639.8285 641.8177 660.6736 696.7697 703.8955 706.9846 718.5128 761.8245 773.4017 813.2632 849.8338 851.7913 881.3021 887.0095 898.9479 918.1803 919.2097 940.7461 943.3789 971.3490 972.8400 980.4414 987.3168 988.1898 991.8972 992.4237 994.5894 1025.3002 1027.3688 1029.5362 1072.1862 1076.9061 1077.3916 1095.0352 1171.5423 1171.8271 1185.8585 1186.6157 1193.3126 1239.3006 1242.4870 1278.4086 1308.1696 1309.2737 1345.5594 1368.4610 1369.1131 1372.5840 1374.5718 1402.3492 1427.9747 1428.1548 1431.4916 1450.3048 1467.3893 1478.7708 1486.9949 1527.1229 1583.0829 1584.0092 1599.1251 1602.1322 1615.3317 1616.6104 1636.2369 2986.8620 3072.0198 3110.9389 3121.8267 3122.3252 3128.0532 3128.5111 3137.0309 3140.2524 3140.4761 3147.5300 3149.1472 3149.5776 3163.9800 3164.3421 3191.2745 3521.0905
redmass: 1.0485 3.8291 3.7252 5.7928 5.4091 4.8863 5.0023 3.6487 4.6761 4.8486 5.7391 5.8188 3.7280 4.3321 3.8108 5.2653 4.6659 4.7483 4.6767 2.8299 2.8223 3.6312 3.8489 3.2188 3.1996 4.7056 4.7063 7.3026 2.6493 6.3858 4.8319 1.7516 4.7645 1.6939 1.7772 2.0847 1.8894 2.1069 5.8927 1.2449 1.2454 1.6319 3.8504 1.4859 1.4878 1.4506 5.0331 1.3836 1.3852 1.3837 3.5231 4.7475 6.1421 2.7359 1.3890 1.3226 2.3062 2.1975 1.6636 2.1185 1.5994 1.5991 1.8363 1.0527 1.0533 1.1148 1.1164 2.0506 1.8284 2.1572 1.3227 1.3725 1.3693 3.8315 6.7871 6.8309 2.3789 1.8485 2.8432 2.2076 2.2134 4.0310 1.1340 1.0469 2.3032 2.7002 2.1848 6.0051 6.0248 5.7342 6.1577 6.3495 6.4775 5.0713 1.0383 1.0984 1.0917 1.0843 1.0844 1.0876 1.0876 1.0978 1.0925 1.0925 1.0925 1.0969 1.0969 1.1018 1.1018 1.0933 1.0763
irintensity: 0.0109 0.0683 0.0245 0.8319 0.3050 10.4833 1.4698 0.2265 0.3185 3.8565 1.2016 0.5903 0.4459 2.2924 0.0046 1.2300 0.1770 1.2429 0.5842 0.0000 0.0003 36.2253 0.1027 2.6010 8.5331 1.9731 0.3334 9.9210 17.4557 1.2346 1.4108 41.7436 6.9833 47.5463 50.4986 22.5607 68.9826 22.4152 0.6754 0.0008 0.0006 27.7595 2.6406 11.9617 0.7741 0.6593 8.7311 19.6984 0.0228 0.0179 2.5644 4.2681 2.2728 27.0234 3.2307 0.1444 15.1723 0.8696 7.3501 2.5666 4.9536 10.3087 9.6779 0.0129 0.0132 2.6967 1.5283 6.9528 40.9668 70.6820 34.6739 0.8808 0.6400 7.7220 0.1540 0.0820 7.9482 59.0989 113.4493 13.3374 1.2144 229.5459 9.2896 19.5564 53.6624 23.4523 241.1525 1.5100 1.3116 85.3173 132.7133 1.4188 12.0306 119.2337 9.3842 15.0832 14.2746 1.5977 2.5240 0.2883 0.5325 7.4317 24.3030 18.2468 1.5234 28.2553 49.7333 29.6855 20.8498 8.1315 10.8811
temp: 298.150 k
press: 1.00000 atm
elementType: 8 7 6 6 6 6 6 6 6 6 6 6 6 6 6 6 6 6 6 6 6 6 1 1 1 1 1 1 1 1 1 1 1 1 1 1 1 1 1
symmnumber: 1
zpe: 814029.2 jmol-1
zpe.correction: 0.310047 hartree
zpe.thermalcorrener: 0.326675 hartree
zpe.thermalcorrenthalpy: 0.327619 hartree
zpe.thermalcorrgfe: 0.264391 hartree
zpe.sumelectzpe: -900.813901 hartree
zpe.sumelectthermal: -900.797273 hartree
zpe.sumelectthermalent: -900.796329 hartree
zpe.sumelectthermalfe: -900.859557 hartree
dipole: 3.4000 1.6628 0.0004
dipole: 3.7848
quadrupole: -129.0625 -109.7301 -119.8371
quadrupole: 11.1311 -0.0067 -0.0016
quadrupole: -9.5192 9.8131 -0.2939 11.1311 -0.0067 -0.0016
hfenergy: -901.1239481 hartree
pointgroup: C01 [X(C20H17N1O1)]
dipole: 1.334782 0.6600759 0.0001452 debye
polarizability: 281.9097125|3.0450631|232.2378118|-0.0023131|-0.0119957|174.06751 unknown
InChI: InChI=1S/C20H17NO/c1-15(22)21-20-13-18(16-8-4-2-5-9-16)12-19(14-20)17-10-6-3-7-11-17/h2-14,21H,1H3
charge 0 multiplicity 1
39 atoms
O  -2.950045 3.340998 -0.000744
N  -0.600637 3.27699 -0.000447
C  -0.992868 -0.479577 -0.000255
C  1.394828 0.120637 0.000121
C  0.371863 -0.861923 0.000009
C  -0.329067 1.878445 -0.000303
C  -1.348328 0.891287 -0.000408
C  1.036016 1.486385 -0.000044
C  -2.068588 -1.529005 -0.000383
C  2.842362 -0.281315 0.000444
C  -2.583699 -2.034862 -1.222012
C  -2.585078 -2.033749 1.221125
C  3.537708 -0.477204 1.222258
C  3.538653 -0.475875 -1.221044
C  -3.592583 -3.024962 -1.222575
C  -3.593957 -3.023854 1.221452
C  4.899048 -0.858048 1.223061
C  4.899993 -0.856727 -1.221204
C  -4.100657 -3.52309 -0.000621
C  5.584782 -1.048837 0.001089
C  -1.83447 3.93655 -0.00062
C  -1.710789 5.462271 -0.000775
H  0.639734 -1.923721 0.000124
H  -2.395578 1.198512 -0.000621
H  1.827435 2.247635 0.000058
H  -2.193553 -1.647488 -2.170122
H  -2.1960 -1.645514 2.169321
H  3.006774 -0.332788 2.170164
H  3.008451 -0.330443 -2.169205
H  0.226591 3.879001 -0.000414
H  -3.981768 -3.404393 -2.174252
H  -3.984205 -3.402428 2.173035
H  5.421792 -1.006848 2.174729
H  5.423469 -1.00451 -2.172628
H  -4.883782 -4.289673 -0.000713
H  6.639689 -1.345515 0.001335
H  -1.170619 5.82173 0.894852
H  -2.72123 5.894677 -0.001065
H  -1.17019 5.821534 -0.896224
