program: Gaussian 09
title: 000274893
version: EM64L-G09RevD.01
frameworkgroup: C1[X(C16H18FN5O8)]
method: RPBEPBE
basis: SDD
operation: Freq
keyword: #p
keyword: freq=noraman
keyword: PBEPBE/SDD
title: #p freq=noraman PBEPBE/SDD
converged: YES YES NO NO
title: Mulliken charges:
elementType: F O O O O O O O O N N N N N C C C C C C C C C C C C C C C C H H H H H H H H H H H H H H H H H H
charge: -0.151397 -0.248852 -0.275463 -0.293295 -0.262718 -0.225551 -0.237703 -0.245357 -0.363464 -0.172599 -0.070763 -0.052184 -0.226388 -0.321847 -0.155979 -0.057958 -0.129479 -0.102286 -0.365599 0.166978 -0.197440 -0.094970 0.302724 0.313524 0.312737 -0.755450 0.327972 -0.758691 -0.005686 -0.767040 0.315631 0.316068 0.298090 0.305721 0.257898 0.260369 0.298949 0.255476 0.253502 0.258289 0.255938 0.255106 0.256760 0.359822 0.242946 0.284020 0.243507 0.396134
chargesum: 0.00000
title: Mulliken charges with hydrogens summed into heavy atoms:
elementType: F O O O O O O O O N N N N N C C C C C C C C C C C C C C C C
charge: -0.151397 -0.248852 -0.275463 -0.293295 -0.262718 -0.225551 -0.237703 -0.245357 0.032670 -0.172599 -0.070763 -0.052184 -0.226388 0.037976 0.159652 0.258110 0.168611 0.203435 0.152667 0.166978 0.101508 -0.094970 0.302724 0.313524 0.312737 0.011817 0.327972 0.009112 -0.005686 0.003434
polarizability: 3.29422680e+02 3.48432281e+00 2.32146508e+02 4.16682461e+00 -1.79763545e+01 1.62679250e+02
1716.lowfreq: -23.8021 -5.9663 -3.3269 -0.0010 -0.0009 -0.0008 2.3931 14.7878 19.3385
frequency: -23.6648 14.5726 19.3083 23.8310 26.8699 33.9745 35.7878 47.2266 55.7914 70.1105 74.1754 75.9787 89.9316 104.2625 105.8894 115.3274 116.3711 129.0811 156.8712 163.1324 178.5121 198.7810 208.2793 217.5460 222.2013 261.6827 275.9550 290.7679 314.9064 333.3823 349.7039 364.9819 387.5535 401.6801 407.7898 423.7792 451.7531 469.1004 480.4410 519.1702 540.7950 562.6652 563.3304 565.4475 569.2652 605.3699 620.5054 626.2915 640.4112 651.4027 657.5381 682.6471 706.5330 729.5913 763.4263 766.6972 771.3250 782.9739 794.0734 821.4242 834.6534 849.2373 861.3848 884.1603 945.0705 955.4319 959.9200 969.0125 978.1379 990.2503 993.5531 1000.7576 1003.2843 1029.7301 1042.1692 1043.8366 1045.9496 1048.5970 1064.8928 1088.4331 1097.4026 1140.7684 1163.9100 1177.1838 1184.8409 1190.8094 1200.4150 1218.3705 1237.3219 1256.2089 1276.8083 1282.8913 1294.2115 1304.1325 1313.9569 1323.5998 1336.1911 1358.4963 1359.8963 1381.9136 1382.1941 1384.9476 1387.2797 1388.6866 1409.8639 1439.2575 1450.8705 1451.3990 1451.7592 1452.9673 1453.5055 1454.6849 1458.8701 1462.3945 1494.9535 1544.3747 1636.3363 1659.1718 1661.6887 1668.3914 3005.7064 3007.5899 3008.5087 3048.6754 3050.8576 3073.1856 3078.2382 3087.7032 3097.0601 3097.5877 3101.5635 3132.1216 3141.8897 3145.2662 3145.9969 3148.0632 3249.9962 3643.1455
redmass: 1.1077 7.0630 7.0563 1.5155 6.6065 3.5426 7.6557 4.7917 6.4742 4.1070 3.8495 4.0659 4.1994 6.4325 5.3457 4.0332 1.1769 8.6114 8.0243 6.8794 8.0960 7.6580 8.3255 7.2734 8.4534 5.8704 4.5262 3.2717 4.5399 5.6109 4.0792 4.1399 3.6451 1.3543 7.3668 5.3415 4.0156 10.9876 5.2524 3.9730 1.3883 3.2137 3.2779 3.2964 9.2856 6.0001 7.0985 5.1973 3.1777 5.8603 4.6478 11.7112 5.9909 4.6720 8.0136 6.4627 7.1253 5.0847 9.9331 5.5207 1.4286 3.8424 4.2577 4.3953 5.0404 6.5765 5.3551 3.4345 3.5555 2.5636 3.8322 2.8642 2.5611 4.2027 1.8731 1.6642 2.2243 1.6758 4.5648 3.1213 1.5359 3.7308 3.0851 3.0010 3.3159 2.2743 3.2226 1.6296 1.5216 1.2164 1.6924 1.4232 1.7132 1.2107 1.6825 1.7431 7.3850 1.4697 1.2762 1.6431 2.9585 1.8026 1.2517 1.4679 2.4053 5.6056 1.0784 1.0594 1.0640 1.0509 1.0608 1.0480 1.0568 2.7205 1.9711 8.9250 7.0290 9.4111 9.8054 9.9139 1.0378 1.0379 1.0376 1.0593 1.0852 1.0866 1.0865 1.0874 1.0962 1.0964 1.0946 1.1083 1.1022 1.1011 1.1012 1.0637 1.0995 1.0827
irintensity: 1.7608 1.3236 0.4353 1.0041 0.3185 1.4750 0.2564 1.1921 2.0770 1.7682 2.0261 5.0082 1.9765 2.6711 0.1774 0.6282 1.0918 1.3887 1.5958 7.9826 4.0273 2.8966 2.1655 12.1991 1.7944 1.6065 10.0196 20.1947 13.9761 9.8528 3.6814 8.8962 21.4864 105.0250 18.9201 0.1033 3.8302 1.0469 4.1188 11.3946 115.3260 3.6599 2.9528 5.9669 6.0915 12.5288 21.7295 8.9749 40.8732 27.2720 2.3157 19.1272 24.8248 59.2249 2.4811 22.9668 11.9679 9.9700 6.7929 13.4032 14.2884 7.8998 138.3769 30.9995 161.5322 113.0609 3.9639 36.7539 34.1409 84.8906 19.2246 136.3345 175.0129 146.4450 39.4128 12.9023 68.0071 18.7808 15.9774 14.0270 16.6499 18.4458 90.9825 206.5738 257.0268 92.1279 387.5187 77.0314 32.8976 10.6182 22.4912 19.9623 3.1001 5.3643 97.3503 29.9001 313.4668 2.9178 0.1942 146.4247 12.9950 84.7494 85.9667 11.9349 70.6023 15.2764 45.6140 2.7536 32.1312 31.6504 1.7955 14.8609 24.1234 28.4256 210.6041 110.4944 366.0400 169.1293 189.3138 151.5800 3.5245 0.6248 0.4831 14.8069 3.8196 6.0379 9.8122 4.8112 4.3248 4.1809 5.2679 4.7708 8.2197 8.4590 7.0168 47.6955 23.1456 188.3549
temp: 298.150 k
press: 1.00000 atm
elementType: 9 8 8 8 8 8 8 8 8 7 7 7 7 7 6 6 6 6 6 6 6 6 6 6 6 6 6 6 6 6 1 1 1 1 1 1 1 1 1 1 1 1 1 1 1 1 1 1
symmnumber: 1
zpe: 910852.9 jmol-1
zpe.correction: 0.346926 hartree
zpe.thermalcorrener: 0.376262 hartree
zpe.thermalcorrenthalpy: 0.377206 hartree
zpe.thermalcorrgfe: 0.281459 hartree
zpe.sumelectzpe: -1593.629042 hartree
zpe.sumelectthermal: -1593.599706 hartree
zpe.sumelectthermalent: -1593.598762 hartree
zpe.sumelectthermalfe: -1593.694509 hartree
dipole: 4.1094 -0.3880 2.9863
dipole: 5.0947
quadrupole: -188.9160 -157.7242 -186.1203
quadrupole: 14.9976 -0.5473 -5.1741
quadrupole: -11.3292 19.8626 -8.5335 14.9976 -0.5473 -5.1741
hfenergy: -1593.9759679 hartree
pointgroup: C01 [X(C16H18F1N5O8)]
dipole: -1.5824616 1.1030884 -0.544616 debye
polarizability: 325.4295793|-19.9924552|167.7641908|-9.8330659|24.0091321|231.0546679 unknown
InChI: InChI=1S/C16H18FN5O8/c1-6(23)27-4-9-11(28-7(2)24)12(29-8(3)25)15(30-9)22-5-18-10-13(21-26)19-16(17)20-14(10)22/h5,9,11-12,15,21,26H,4H2,1-3H3
charge 0 multiplicity 1
48 atoms
F  5.419959 -0.404257 2.096856
O  -0.536366 -1.352294 0.67252
O  -0.766335 1.756309 1.506976
O  -1.857969 0.264365 -1.694102
O  -4.03159 -0.366776 1.693546
O  -1.345389 3.664081 0.293962
O  -4.189471 0.290909 -1.752322
O  -4.736838 -2.419374 0.839251
O  6.975432 -1.487988 -2.175023
N  1.374078 -0.429571 -0.448093
N  2.392793 -0.974063 -2.432413
N  3.363579 -0.371197 1.038818
N  5.429093 -0.878436 -0.158993
N  5.566912 -1.357779 -2.406309
C  -0.580396 1.032491 0.225084
C  -1.924595 0.416941 -0.214987
C  0.339878 -0.171007 0.556205
C  -1.957127 -0.961437 0.471924
C  -2.664942 -0.931721 1.84445
C  2.738268 -0.548756 -0.166044
C  1.224804 -0.702785 -1.824363
C  3.347828 -0.879349 -1.404133
C  -1.161372 3.114116 1.397882
C  -3.10313 0.22022 -2.362478
C  4.763442 -1.044962 -1.361005
C  -1.313876 3.720482 2.770121
C  -4.992318 -1.228124 1.118545
C  -2.897882 0.068449 -3.849324
C  4.687779 -0.560923 0.922979
C  -6.282344 -0.489225 0.872637
H  -0.175413 1.718099 -0.536771
H  -2.798005 1.03658 0.043391
H  0.871212 -0.007646 1.510586
H  -2.417039 -1.732109 -0.167642
H  -2.156044 -0.252803 2.544857
H  -2.720048 -1.954059 2.253748
H  0.249426 -0.685263 -2.302955
H  -2.173326 3.259625 3.289228
H  -1.481913 4.803003 2.680282
H  -0.416683 3.524525 3.380497
H  -3.855787 0.206151 -4.370586
H  -2.50766 -0.940677 -4.073637
H  -2.158199 0.799642 -4.215228
H  5.287632 -1.536079 -3.367624
H  -6.477133 0.249576 1.66559
H  -6.183906 0.0516 -0.086824
H  -7.115429 -1.203298 0.795328
H  7.019309 -1.288501 -1.176808
