program: Gaussian 09
title: 000274595
version: EM64L-G09RevD.01
frameworkgroup: C1[X(C20H13IN2)]
method: RPBEPBE
basis: SDD
operation: Freq
keyword: #p
keyword: freq=noraman
keyword: PBEPBE/SDD
title: #p freq=noraman PBEPBE/SDD
converged: YES YES NO NO
title: Mulliken charges:
elementType: I N N C C C C C C C C C C C C C C C C C C C C H H H H H H H H H H H H H
charge: 0.096632 -0.013484 -0.076018 0.231623 0.232274 0.257003 0.268878 -0.383860 -0.400889 -0.407219 -0.432802 -0.392561 -0.230927 -0.227667 -0.232673 -0.252224 0.451011 -0.351826 -0.289030 -0.379693 -0.322702 -0.209889 -0.180070 0.247624 0.249650 0.278670 0.281478 0.228523 0.230139 0.231610 0.234257 0.247337 0.288860 0.236020 0.237490 0.254455
chargesum: 0.00000
title: Mulliken charges with hydrogens summed into heavy atoms:
elementType: I N N C C C C C C C C C C C C C C C C C C C C
charge: 0.096632 -0.013484 -0.076018 0.231623 0.232274 0.257003 0.268878 -0.383860 -0.153265 -0.157569 -0.154132 -0.111084 -0.002404 0.002472 -0.001063 -0.017967 0.451011 -0.104489 -0.000169 -0.143672 -0.322702 0.027600 0.074386
polarizability: 4.95289329e+02 -1.02589942e+01 2.81474696e+02 4.64687079e+01 1.84703849e+00 1.50484492e+02
1716.lowfreq: -3.0099 -0.0004 -0.0002 0.0005 2.9204 5.4648 8.9396 24.1189 30.4148
frequency: 8.6316 24.0665 30.3897 70.3283 95.7235 105.9343 136.6709 143.2426 149.3263 182.7725 207.9742 235.3147 248.4822 261.3951 286.5843 303.1085 391.4582 411.7729 414.8160 432.7578 435.1880 451.5447 490.4223 509.4632 526.1716 564.1818 570.3110 615.5811 629.3231 650.5292 654.5461 662.7046 692.2820 717.1222 749.5116 759.7154 765.3353 790.9441 804.1690 811.8873 869.4726 891.5248 901.7708 905.1582 919.5686 929.5955 954.9046 958.8234 961.9156 971.0452 979.4271 985.1180 991.5622 993.3314 993.4634 1018.1089 1033.3024 1058.1492 1085.9611 1098.0130 1104.1692 1164.3381 1169.7105 1175.9889 1180.9376 1219.6080 1225.8106 1241.2642 1279.1458 1297.6745 1303.2975 1344.6867 1377.0035 1379.3250 1404.5481 1414.9248 1438.9467 1445.3062 1455.6268 1464.2460 1478.9766 1535.8416 1562.8718 1587.6898 1590.8882 1596.0469 1598.8833 1615.5203 1620.3114 3034.4704 3126.7980 3128.3685 3130.5082 3139.6313 3142.0103 3152.3549 3153.7601 3157.5931 3167.7245 3167.7377 3174.0728 3174.7994
redmass: 6.9948 8.6542 5.7024 6.5025 4.5775 4.8018 3.8624 4.5220 5.9711 6.3025 5.3410 3.8641 7.9380 5.2076 5.1273 5.1612 4.5007 5.6751 4.1040 3.2804 3.7723 5.2058 4.2480 5.5732 6.1715 5.8751 3.2644 7.0613 6.9215 4.8358 5.5962 6.5322 2.2419 5.2411 1.5071 2.7456 1.9398 1.4970 2.4292 2.5799 4.7841 1.4543 1.7290 1.4903 2.1767 2.0012 2.2058 1.4595 1.4450 3.6460 5.6890 1.3947 1.3609 3.8807 1.5551 2.2343 1.8350 2.1753 2.3078 1.6604 1.6484 1.6263 1.0893 1.3911 1.0883 2.3292 2.0128 2.1332 1.2704 1.7811 1.7025 1.9635 7.7747 5.6724 2.9100 2.7474 2.2508 3.0412 2.5407 2.7974 4.2204 7.8765 7.2319 7.1586 6.8139 6.6360 6.9882 7.5837 7.5827 1.0891 1.0860 1.0859 1.0879 1.0904 1.0909 1.0927 1.0947 1.0957 1.0937 1.0986 1.0978 1.0980
irintensity: 0.2984 0.0819 0.7238 0.1748 0.2145 2.8368 0.4102 2.6571 0.2464 0.2808 1.8545 2.7577 1.9384 0.7442 0.5342 2.1260 2.5772 1.2399 7.1467 1.9610 4.8249 3.7492 3.8065 0.2234 7.7842 6.5340 0.2046 1.7844 1.9715 28.4821 28.2582 39.3058 29.3126 6.2228 130.5480 7.0454 8.5630 38.8262 6.0071 32.8375 19.7139 1.7070 1.1850 0.0712 7.0473 11.2695 27.7923 2.3179 4.1051 31.2681 14.3034 4.6506 0.1410 2.3445 1.2997 1.5475 2.0402 17.2205 1.7155 3.6680 6.5503 5.2317 0.6150 4.4450 1.3566 16.8853 28.6781 1.9212 21.0998 3.9350 20.5831 17.3500 7.1366 0.6172 1.2990 34.0445 41.4033 47.2087 29.3653 0.9568 21.9989 9.0070 37.8389 50.2987 3.2614 14.6000 1.8874 23.2831 12.4518 25.8038 2.7943 1.2602 6.7787 8.1809 7.8401 15.7661 23.6157 35.3802 6.0546 30.0986 11.7292 13.6084
temp: 298.150 k
press: 1.00000 atm
elementType: 53 7 7 6 6 6 6 6 6 6 6 6 6 6 6 6 6 6 6 6 6 6 6 1 1 1 1 1 1 1 1 1 1 1 1 1
symmnumber: 1
zpe: 703495.8 jmol-1
zpe.correction: 0.267947 hartree
zpe.thermalcorrener: 0.286423 hartree
zpe.thermalcorrenthalpy: 0.287367 hartree
zpe.thermalcorrgfe: 0.217267 hartree
zpe.sumelectzpe: -889.377107 hartree
zpe.sumelectthermal: -889.358632 hartree
zpe.sumelectthermalent: -889.357687 hartree
zpe.sumelectthermalfe: -889.427788 hartree
dipole: -1.0177 -0.5238 2.3389
dipole: 2.6040
quadrupole: -125.9749 -130.9629 -148.0896
quadrupole: -8.3707 7.4310 -2.4155
quadrupole: 9.0342 4.0463 -13.0805 -8.3707 7.4310 -2.4155
hfenergy: -889.6450545 hartree
pointgroup: C01 [X(C20H13I1N2)]
dipole: 0.2038226 0.0805942 1.0007557 debye
polarizability: 499.808232|13.8697119|279.6018721|19.5021148|19.1576358|147.8384125 unknown
InChI: InChI=1S/C20H13IN2/c21-15-7-5-6-14(12-15)13-22-23-20-18-10-3-1-8-16(18)17-9-2-4-11-19(17)20/h1-13H
charge 0 multiplicity 1
36 atoms
I  -5.686868 -1.561494 -2.638933
N  0.341103 1.379066 -0.457521
N  -0.949355 0.912938 -0.55222
C  3.577685 -0.179258 0.001876
C  2.696531 -1.348348 0.223744
C  2.751873 0.954655 -0.277269
C  1.331861 -0.923925 0.089867
C  1.331004 0.52727 -0.23498
C  4.978706 -0.047713 0.02104
C  2.997084 -2.691326 0.511743
C  3.311238 2.218129 -0.537234
C  0.2720 -1.83976 0.243277
C  5.545575 1.225591 -0.242005
C  1.928715 -3.612999 0.662129
C  4.722391 2.346317 -0.519445
C  0.582712 -3.19425 0.525857
C  -3.312284 1.147026 -0.035945
C  -1.899504 1.50234 0.146399
C  -3.714779 0.189304 -1.013617
C  -4.298472 1.772184 0.775012
C  -5.078179 -0.113975 -1.158708
C  -5.66201 1.451954 0.612481
C  -6.067453 0.504561 -0.35632
H  5.626427 -0.905667 0.232301
H  4.033901 -3.029083 0.616364
H  2.665254 3.075999 -0.747779
H  -0.766937 -1.514358 0.144348
H  6.634641 1.346038 -0.231094
H  2.147019 -4.662803 0.887904
H  5.183792 3.319375 -0.720087
H  -0.226389 -3.922872 0.644672
H  -1.656288 2.27162 0.900103
H  -2.946806 -0.28136 -1.633984
H  -3.992852 2.507886 1.528391
H  -6.419979 1.935972 1.237278
H  -7.125156 0.256767 -0.481143
