program: Gaussian 09
title: 000274608
version: EM64L-G09RevD.01
frameworkgroup: C1[X(C26H16N2S)]
method: RPBEPBE
basis: SDD
operation: Freq
keyword: #p
keyword: freq=noraman
keyword: PBEPBE/SDD
title: #p freq=noraman PBEPBE/SDD
converged: YES YES NO NO
title: Mulliken charges:
elementType: S N N C C C C C C C C C C C C C C C C C C C C C C C C C C H H H H H H H H H H H H H H H H
charge: 0.198137 -0.057149 -0.117410 0.220478 0.231444 0.257286 0.251550 -0.344297 -0.402624 -0.410604 -0.444595 -0.385915 -0.002665 0.426878 0.467674 -0.350068 -0.354999 -0.234729 -0.230535 -0.234251 -0.257335 -0.332379 -0.300184 -0.292432 -0.296781 -0.245805 -0.281247 -0.230301 -0.228059 0.247175 0.248643 0.273972 0.283959 0.227113 0.228012 0.229539 0.231591 0.281593 0.295125 0.245705 0.246254 0.234279 0.236312 0.235056 0.236588
chargesum: 0.00000
title: Mulliken charges with hydrogens summed into heavy atoms:
elementType: S N N C C C C C C C C C C C C C C C C C C C C C C C C C C
charge: 0.198137 -0.057149 -0.117410 0.220478 0.231444 0.257286 0.251550 -0.344297 -0.155449 -0.161961 -0.170623 -0.101956 -0.002665 0.426878 0.467674 -0.350068 -0.354999 -0.007616 -0.002522 -0.004713 -0.025744 -0.050787 -0.005059 -0.046726 -0.050527 -0.011526 -0.044935 0.004755 0.008529
polarizability: 5.57354092e+02 3.18669317e+01 3.55176602e+02 -1.32067330e+01 -1.04937453e+01 2.19077506e+02
1716.lowfreq: -3.1213 -1.3372 -0.0017 -0.0007 -0.0005 3.2636 13.8431 20.5809 33.1292
frequency: 13.7989 20.5781 33.1286 36.5818 89.6024 102.7378 104.9459 126.0212 140.3947 141.5117 178.8881 216.3488 223.3311 238.4141 272.4302 277.8416 307.7152 333.9781 372.3278 402.4636 407.6084 412.8214 423.5553 435.7642 442.1774 455.2038 462.1547 475.2947 491.0434 509.8223 520.0200 558.4645 570.0507 573.8774 615.3522 630.1854 637.3673 646.4310 654.4921 666.4324 700.8656 717.9928 729.7969 738.8094 742.5785 748.1446 762.4915 766.4813 768.8328 782.5992 801.4647 805.1027 875.4186 876.5201 888.3496 897.6765 920.0046 925.8137 957.0843 958.0383 963.9817 964.2559 987.9347 988.6744 991.3121 992.4480 996.6464 997.8927 1017.7495 1030.3952 1032.9861 1037.4014 1057.9353 1060.1578 1090.6581 1104.7854 1119.8999 1139.5006 1161.4454 1168.9083 1172.5437 1174.0171 1179.9697 1201.4457 1222.5469 1241.7188 1249.3282 1271.4574 1298.5011 1306.6595 1316.0206 1365.8030 1379.8917 1383.9205 1401.7014 1420.9528 1423.0649 1437.9439 1443.6606 1458.0051 1463.7024 1465.2929 1474.5595 1514.7207 1553.6670 1560.2456 1579.1562 1588.8638 1593.8807 1594.2645 1606.7582 1613.5045 1618.9620 3125.0805 3126.7914 3131.7603 3132.6553 3136.9737 3140.3582 3141.9120 3144.1256 3149.8968 3153.5717 3156.4199 3160.5222 3164.5953 3169.0289 3172.4105 3173.3682
redmass: 6.7692 6.0438 5.7849 6.0685 4.2809 4.3667 4.4613 5.5724 4.7012 4.4966 6.1381 5.1653 5.6972 5.3108 5.3179 7.5594 6.1203 6.6473 5.5971 3.9461 4.5935 6.4542 5.5733 3.8284 4.2957 6.3174 5.0600 4.1383 4.8126 5.3297 4.6661 6.4698 5.0979 4.5369 7.0590 6.4650 4.5466 4.2682 6.4732 6.7860 6.9880 6.1113 3.9792 4.4865 2.4050 1.5508 1.4567 1.4857 3.4915 1.9507 2.5034 2.5177 1.3996 1.3869 1.4271 1.6760 6.8685 7.2566 1.4427 1.4366 1.3718 1.3880 2.9443 1.4140 1.6320 5.3626 1.3362 1.4599 2.2371 5.1375 1.8388 3.2668 2.1052 3.8431 2.4482 1.6399 1.8826 1.7359 1.7604 1.1006 1.1910 1.0610 1.0821 2.8719 2.2397 1.8729 1.9768 1.5408 1.7911 1.7636 2.5946 8.8148 8.5684 7.9233 2.9131 2.2789 2.3508 2.2766 3.1525 2.4043 2.5971 2.7715 3.7265 9.0564 8.8866 7.0125 7.3300 6.8541 6.6273 6.1277 6.4320 7.4270 7.4704 1.0856 1.0857 1.0863 1.0860 1.0899 1.0908 1.0895 1.0903 1.0946 1.0943 1.0956 1.0948 1.1002 1.1010 1.0979 1.0993
irintensity: 0.0624 0.0329 0.2369 1.0330 0.4075 0.2861 0.8031 2.8493 0.0316 0.0628 2.1883 0.0955 0.6168 0.7889 0.4364 0.3149 0.9526 6.1399 1.8432 5.3500 1.1764 0.1242 5.9012 4.7878 0.1123 3.8032 4.7811 9.2534 27.3095 0.2352 14.5488 1.9512 9.4867 17.0052 1.3538 30.9746 21.2671 20.3439 11.5191 9.7264 9.5036 1.2120 2.1450 8.9802 61.7597 120.7297 2.1373 5.3393 4.4889 65.8293 14.6375 25.9917 0.1337 0.3419 0.8743 0.6814 22.3669 28.4830 0.2066 5.3310 1.2737 1.0761 10.5833 0.9415 3.6009 5.5108 0.3057 4.2105 2.0700 46.4654 3.3938 7.5796 5.2572 23.4526 12.2741 4.1767 2.2836 4.9650 7.3790 0.8413 5.7405 5.7696 6.4661 12.5662 3.9697 0.3266 7.0967 11.1278 4.4363 8.6834 70.1781 2.7480 10.0436 11.7796 0.6715 16.7962 61.2476 40.0875 76.4237 33.7966 14.5742 0.6711 63.8885 74.7494 17.6076 4.0009 37.0645 7.4669 8.2729 25.3404 1.9982 15.7022 12.0675 1.9502 2.1367 1.6888 0.5831 7.8806 6.8774 4.6853 7.9946 24.5072 7.1243 41.0325 21.5760 41.7686 32.6984 11.6257 21.3862
temp: 298.150 k
press: 1.00000 atm
elementType: 16 7 7 6 6 6 6 6 6 6 6 6 6 6 6 6 6 6 6 6 6 6 6 6 6 6 6 6 6 1 1 1 1 1 1 1 1 1 1 1 1 1 1 1 1
symmnumber: 1
zpe: 887906.6 jmol-1
zpe.correction: 0.338186 hartree
zpe.thermalcorrener: 0.359929 hartree
zpe.thermalcorrenthalpy: 0.360873 hartree
zpe.thermalcorrgfe: 0.285470 hartree
zpe.sumelectzpe: -1506.007668 hartree
zpe.sumelectthermal: -1505.985925 hartree
zpe.sumelectthermalent: -1505.984981 hartree
zpe.sumelectthermalfe: -1506.060384 hartree
dipole: -0.3124 0.1815 0.9939
dipole: 1.0576
quadrupole: -149.9490 -153.7832 -173.4006
quadrupole: 4.9927 0.9976 -0.0707
quadrupole: 9.0952 5.2611 -14.3563 4.9927 0.9976 -0.0707
hfenergy: -1506.345854 hartree
pointgroup: C01 [X(C26H16N2S1)]
dipole: -0.1112222 -0.050972 -0.3976816 debye
polarizability: 558.1093621|-27.1769433|354.3623464|20.2266933|-2.65393|219.1364924 unknown
InChI: InChI=1S/C26H16N2S/c1-3-11-19-17(9-1)18-10-2-4-12-20(18)25(19)27-28-26-21-13-5-7-15-23(21)29-24-16-8-6-14-22(24)26/h1-16H
charge 0 multiplicity 1
45 atoms
S  -4.606588 -0.648738 -1.110052
N  0.536612 -0.399139 1.039034
N  -0.621465 0.286578 0.90689
C  4.006068 0.170686 0.153366
C  3.361672 1.267565 -0.601791
C  2.984425 -0.549356 0.852595
C  1.945108 1.20725 -0.371938
C  1.67671 0.073235 0.543996
C  5.354358 -0.216704 0.272821
C  3.903752 2.269067 -1.427639
C  3.301126 -1.650317 1.669942
C  1.075625 2.146484 -0.962698
C  -1.791984 -0.181543 0.467968
C  -2.939146 0.72713 0.756862
C  -1.987117 -1.468008 -0.254621
C  -4.211531 0.617644 0.133259
C  -3.187871 -1.778529 -0.96493
C  5.674278 -1.326796 1.094778
C  3.027489 3.214672 -2.019545
C  4.659341 -2.03539 1.787497
C  1.630921 3.157312 -1.786974
C  -2.767411 1.779512 1.706786
C  -0.965518 -2.468858 -0.251251
C  -5.260701 1.523102 0.433101
C  -3.346145 -3.013112 -1.641052
C  -3.801078 2.678593 2.010986
C  -1.125845 -3.700051 -0.907987
C  -5.05871 2.554303 1.367318
C  -2.320024 -3.974822 -1.616303
H  6.147807 0.324674 -0.254277
H  4.981958 2.326914 -1.613111
H  2.512626 -2.188904 2.205225
H  -0.002363 2.098295 -0.786311
H  6.718735 -1.641572 1.198462
H  3.434889 3.99992 -2.666299
H  4.9310 -2.887816 2.419867
H  0.973304 3.898762 -2.253571
H  -1.788568 1.866604 2.186489
H  -0.038266 -2.26077 0.288422
H  -6.231232 1.409596 -0.062368
H  -4.279465 -3.218211 -2.17703
H  -3.634872 3.473168 2.745792
H  -0.31874 -4.439088 -0.878148
H  -5.873309 3.249291 1.596934
H  -2.451255 -4.925833 -2.143196
