program: Gaussian 09
title: 000026436
version: EM64L-G09RevD.01
frameworkgroup: C1[X(C16H16O2)]
method: RPBEPBE
basis: SDD
operation: Freq
keyword: #pfreq=noraman
keyword: PBEPBE/SDD
title: #p freq=noraman PBEPBE/SDD
converged: YES YES NO NO
title: Mulliken charges:
elementType: O O C C C C C C C C C C C C C C C C H H H H H H H H H H H H H H H H
charge: -0.259083 -0.247527 0.449942 0.346152 -0.651141 0.340866 -0.375478 -0.428602 -0.392232 -0.394446 -0.396978 -0.395762 0.282563 -0.235615 -0.235513 -0.242385 -0.228827 -0.673699 0.243199 0.236838 0.257653 0.232635 0.238484 0.238243 0.237639 0.239094 0.225037 0.225473 0.229365 0.231660 0.229123 0.211989 0.229309 0.232027
chargesum: 0.00000
title: Mulliken charges with hydrogens summed into heavy atoms:
elementType: O O C C C C C C C C C C C C C C C C
charge: -0.259083 -0.247527 0.449942 0.346152 -0.171104 0.340866 -0.117826 -0.195967 -0.153747 -0.156203 -0.159340 -0.156668 0.282563 -0.010578 -0.010040 -0.013021 0.231956 -0.000373
polarizability: 2.77702565e+02 -5.91250415e+00 1.55927149e+02 2.37124689e+01 1.85644814e+01 1.22409622e+02
1716.lowfreq: -8.2080 -3.9188 -0.0007 0.0005 0.0007 7.1113 10.2217 15.6026 43.3863
frequency: 8.8806 15.4369 43.3630 54.4543 68.0468 81.6800 112.8489 150.4285 162.9749 200.5393 252.8644 270.7103 302.0740 325.6706 353.5421 400.5091 404.3018 409.2974 412.3461 490.7673 533.1806 555.5538 604.0714 614.6946 638.2380 690.0586 701.5665 716.0955 751.8281 770.7486 790.6167 798.9609 815.5815 845.5796 849.8537 858.3048 914.7429 920.7251 938.1899 962.4389 973.3102 974.0999 988.3944 993.3402 996.3547 1018.1289 1024.8045 1040.9197 1085.1671 1095.7497 1114.3261 1128.5205 1135.9545 1173.3603 1191.0343 1198.4413 1212.4955 1228.7650 1249.1536 1286.6366 1289.9248 1305.2475 1321.9181 1356.1335 1368.9877 1375.1677 1401.0683 1412.7583 1439.4280 1452.4187 1464.0181 1474.0237 1476.8385 1486.7833 1516.2527 1569.1385 1589.2702 1612.9587 1619.7403 1635.0781 2995.9871 3011.3531 3016.2110 3070.0987 3092.5441 3097.4246 3108.0911 3121.1884 3122.7457 3126.6660 3129.9390 3139.9322 3145.3410 3149.0004 3153.4003 3164.9305
redmass: 4.1905 3.8906 4.1821 3.3778 3.6957 4.7947 4.2456 2.8791 3.7892 3.6459 1.3573 4.4463 5.3731 4.8325 3.1882 2.4816 2.8356 2.9121 4.1366 3.3468 4.9333 3.0470 5.0522 6.4094 6.5246 5.5491 1.7459 3.9313 2.9387 2.3108 3.3973 1.1109 2.8977 1.2965 1.2557 2.0824 3.0969 1.7656 1.8718 1.4698 1.4215 1.4137 5.0004 1.3157 6.6388 2.8095 2.4555 1.9032 1.6271 1.8496 2.1922 1.4146 1.4678 1.0524 1.1108 1.3783 1.8816 1.6474 1.1408 1.5530 3.0199 1.4786 1.3109 1.4469 2.5746 8.6489 1.2665 3.4642 2.3630 1.1068 1.0402 1.0684 2.1195 1.0674 2.8236 5.9665 6.5625 6.0451 6.5546 9.3983 1.0358 1.0582 1.0617 1.1066 1.0985 1.1002 1.1027 1.0865 1.0855 1.0875 1.0874 1.0921 1.0959 1.0961 1.0970 1.1016
irintensity: 0.6881 0.4544 0.4795 1.4977 0.0229 0.3594 0.1744 4.1384 5.2085 1.3515 0.6353 0.3174 6.9092 2.6851 8.1709 0.6155 0.1609 0.1827 1.6442 13.6908 4.7303 6.7006 8.0763 0.1989 0.3512 9.7977 46.8701 0.9875 40.0124 57.9189 2.6667 4.0745 11.4173 1.8651 0.9693 28.5187 15.5406 12.0048 10.5600 5.8865 0.3916 0.3160 0.3942 0.0753 13.7205 3.8595 80.9061 3.9855 10.3406 171.1857 8.4366 70.8465 6.4937 0.0404 0.4502 2.8187 2.2161 179.7034 3.0139 64.8502 0.1615 6.5022 7.8410 1.9065 8.0277 1.8396 21.2474 6.5744 5.8995 16.3354 11.0951 7.3107 51.7827 13.4313 13.7178 0.8923 2.1175 9.4106 22.6240 145.2821 21.8822 17.9682 15.5407 8.1856 29.1058 6.6040 45.7793 20.3108 0.3800 6.1380 8.5410 12.3578 9.8927 51.8618 2.8134 26.5567
temp: 298.150 k
press: 1.00000 atm
elementType: 8 8 6 6 6 6 6 6 6 6 6 6 6 6 6 6 6 6 1 1 1 1 1 1 1 1 1 1 1 1 1 1 1 1
symmnumber: 1
zpe: 722022.5 jmol-1
zpe.correction: 0.275004 hartree
zpe.thermalcorrener: 0.291616 hartree
zpe.thermalcorrenthalpy: 0.292560 hartree
zpe.thermalcorrgfe: 0.226725 hartree
zpe.sumelectzpe: -768.477433 hartree
zpe.sumelectthermal: -768.460822 hartree
zpe.sumelectthermalent: -768.459878 hartree
zpe.sumelectthermalfe: -768.525713 hartree
dipole: -0.5263 -1.7737 0.4176
dipole: 1.8967
quadrupole: -88.3331 -104.9966 -102.3601
quadrupole: 5.5709 -0.9268 3.8969
quadrupole: 10.2301 -6.4333 -3.7968 5.5709 -0.9268 3.8969
hfenergy: -768.7524373 hartree
pointgroup: C01 [X(C16H16O2)]
dipole: 0.2429864 0.0451753 0.7040942 debye
polarizability: 273.8813017|28.3276579|136.9751992|-20.232823|22.6383396|145.1828363 unknown
InChI: InChI=1S/C16H16O2/c1-2-18-16(17)12-13-8-10-15(11-9-13)14-6-4-3-5-7-14/h3-11H,2,12H2,1H3
charge 0 multiplicity 1
34 atoms
O  4.491521 0.246653 0.110037
O  3.814316 -0.202171 -2.074972
C  1.350858 1.201901 -0.586126
C  -1.348805 0.331963 -0.143888
C  2.787292 1.66964 -0.822511
C  -2.75232 -0.118122 0.085094
C  0.634291 0.517155 -1.600787
C  0.705162 1.441231 0.651199
C  -0.690678 0.092144 -1.382445
C  -0.621536 1.014248 0.86876
C  -3.635464 0.630356 0.912347
C  -3.247323 -1.309082 -0.515723
C  3.729998 0.488488 -1.032772
C  -4.962501 0.204063 1.132443
C  -4.574757 -1.735797 -0.298409
C  -5.440426 -0.981885 0.527824
C  5.41579 -0.93104 0.046814
C  6.14545 -0.989339 1.384425
H  2.835624 2.288709 -1.737079
H  3.142358 2.269702 0.029925
H  1.122306 0.315814 -2.561201
H  1.246984 1.955322 1.454058
H  -1.233346 -0.405351 -2.194107
H  -1.086309 1.185755 1.846188
H  -3.289855 1.568862 1.3607
H  -2.578854 -1.921042 -1.132025
H  -5.62669 0.801888 1.766892
H  -4.930534 -2.661272 -0.765195
H  -6.470893 -1.313043 0.697652
H  4.808484 -1.833559 -0.147131
H  6.101518 -0.787532 -0.80769
H  6.841206 -1.848146 1.393487
H  6.728373 -0.068421 1.556704
H  5.432361 -1.111489 2.217417
