program: Gaussian 09
title: 000274545
version: EM64L-G09RevD.01
frameworkgroup: C1[X(C12H23NO)]
method: RPBEPBE
basis: SDD
operation: Freq
keyword: #p
keyword: freq=noraman
keyword: PBEPBE/SDD
title: #p freq=noraman PBEPBE/SDD
converged: YES YES NO NO
title: Mulliken charges:
elementType: O N C C C C C C C C C C C C H H H H H H H H H H H H H H H H H H H H H H H
charge: -0.435670 -0.145580 -0.145151 -0.073086 -0.380574 -0.381506 -0.373510 -0.709789 -0.706619 -0.330888 -0.322455 0.227154 -0.693108 -0.543353 0.213725 0.205782 0.194844 0.219781 0.194793 0.231260 0.188418 0.195846 0.214888 0.240792 0.201086 0.196505 0.213449 0.239691 0.184790 0.224804 0.226131 0.184688 0.207752 0.217267 0.205542 0.331124 0.281176
chargesum: 0.00000
title: Mulliken charges with hydrogens summed into heavy atoms:
elementType: O N C C C C C C C C C C C C
charge: -0.104546 -0.145580 0.068574 0.132696 0.034051 0.044547 0.010754 -0.053023 -0.056974 0.078706 0.088363 0.227154 -0.062547 -0.262176
polarizability: 1.49498369e+02 1.98023247e-01 1.33007390e+02 -1.39581901e+01 4.50237819e+00 1.37243134e+02
1716.lowfreq: -22.4515 -10.6051 -5.4242 -0.0005 0.0004 0.0006 16.2418 46.6021 54.9710
frequency: -7.6977 46.5917 54.9401 57.6535 74.4914 79.3673 85.6584 116.0297 133.8920 173.9381 193.5372 210.1314 222.3315 231.9321 250.8809 278.2881 300.6351 310.1226 316.2579 340.2153 366.3460 400.5677 436.5693 446.1740 507.5604 553.7680 613.1678 631.5688 639.2889 735.9708 780.1205 804.3005 818.1152 833.2536 879.0134 900.8510 928.1390 943.6103 952.1157 959.9361 976.5889 983.8728 1033.6228 1044.1269 1058.7806 1083.8722 1099.6079 1115.3597 1126.5805 1130.6498 1170.4762 1177.4957 1203.7093 1238.4189 1248.3345 1255.6289 1281.3963 1288.1812 1293.5990 1306.8626 1310.2398 1326.2823 1337.4691 1346.1346 1358.0215 1367.1014 1377.7485 1382.8199 1392.7060 1398.3018 1461.7363 1462.2339 1464.7072 1469.5867 1471.3998 1475.4478 1477.7053 1479.9139 1480.8150 1486.5074 1492.1359 2107.3713 2870.5682 2887.9043 2960.5995 2965.4284 2970.6883 2972.9307 2973.8269 2975.0283 2976.5038 2994.7929 3006.1821 3024.1960 3039.4272 3060.1727 3062.2585 3068.1848 3071.0457 3071.3881 3084.9503 3094.8594 3095.9152 3421.5454 3558.3317
redmass: 3.3602 3.8484 2.7334 3.6162 2.6870 2.0737 1.8762 3.7492 3.0962 2.9211 1.1680 2.4630 1.2606 1.1188 2.2642 2.2761 1.8363 1.9514 2.2729 2.5511 3.4031 2.7342 3.8189 2.8607 3.7609 2.7410 5.0609 1.2342 1.2313 1.2101 1.5177 1.7098 2.0043 1.8248 1.8511 2.3710 1.2055 1.4377 1.7571 2.6388 2.2165 2.1361 2.7806 2.8648 2.3075 1.9205 2.3166 2.0093 1.8247 2.0016 2.3398 1.9311 1.6673 1.4334 1.3243 1.2669 1.1207 1.1259 1.2778 1.3253 1.4010 1.3703 1.3577 1.2443 1.4957 1.3087 1.2413 1.2812 1.2161 1.2103 1.0651 1.0663 1.0654 1.0552 1.0800 1.0523 1.0436 1.0450 1.0837 1.0752 1.0594 6.0344 1.0715 1.0697 1.0693 1.0593 1.0390 1.0371 1.0656 1.0646 1.0517 1.0837 1.0940 1.0909 1.0990 1.0866 1.0982 1.1006 1.0977 1.0989 1.0994 1.0979 1.0972 1.1570 1.0660
irintensity: 0.0714 0.1716 0.7095 1.7891 1.4130 0.9499 3.0144 0.2580 0.6292 0.3295 0.7286 4.4383 0.4511 0.1034 1.8543 9.3091 56.5283 62.6830 1.3938 30.5062 22.7777 3.7099 3.5075 0.5547 5.1017 8.2733 7.9798 68.6056 68.4437 6.0268 10.6437 4.7127 1.6164 1.9250 0.4550 4.4383 3.2506 28.6363 29.6908 88.2875 18.1882 20.8309 22.4967 16.7276 26.0627 0.7566 43.2926 5.1433 1.8842 1.7922 8.5917 9.0442 11.4248 10.2608 1.3799 10.1904 1.1625 6.0268 6.1252 4.6060 0.8927 0.5874 2.9715 27.7538 4.0353 3.2599 9.1544 12.0108 11.0961 21.6450 7.5522 3.0850 4.0491 1.9726 12.8169 5.5429 10.7290 9.6990 2.9269 10.5401 28.5908 5.0298 61.7350 82.4038 68.3602 9.9340 35.2469 22.1159 41.5242 31.0892 18.3285 36.2571 10.2230 41.2414 20.0793 11.3113 2.9229 115.0421 74.6422 45.0319 26.7267 48.9037 14.0901 65.2834 6.6510
temp: 298.150 k
press: 1.00000 atm
elementType: 8 7 6 6 6 6 6 6 6 6 6 6 6 6 1 1 1 1 1 1 1 1 1 1 1 1 1 1 1 1 1 1 1 1 1 1 1
symmnumber: 1
zpe: 854478.3 jmol-1
zpe.correction: 0.325454 hartree
zpe.thermalcorrener: 0.343076 hartree
zpe.thermalcorrenthalpy: 0.344020 hartree
zpe.thermalcorrgfe: 0.280133 hartree
zpe.sumelectzpe: -599.801752 hartree
zpe.sumelectthermal: -599.784129 hartree
zpe.sumelectthermalent: -599.783185 hartree
zpe.sumelectthermalfe: -599.847072 hartree
dipole: 0.6142 -0.8338 1.8668
dipole: 2.1348
quadrupole: -88.0707 -93.2537 -88.5445
quadrupole: 1.3900 -1.1857 9.8641
quadrupole: 1.8856 -3.2974 1.4118 1.3900 -1.1857 9.8641
hfenergy: -600.1272051 hartree
pointgroup: C01 [X(C12H23N1O1)]
dipole: -0.460699 -0.1228979 -0.6914415 debye
polarizability: 141.6018977|-5.8853083|136.8123747|-15.2688724|3.6701786|141.3346203 unknown
InChI: InChI=1S/C12H23NO/c1-5-7-8-13(9-10-14)12(6-2)11(3)4/h2,11-12,14H,5,7-10H2,1,3-4H3
charge 0 multiplicity 1
37 atoms
O  2.593566 3.069401 0.820663
N  0.166888 0.337063 -0.228633
C  0.334535 -1.141368 -0.383416
C  0.902503 -1.829972 0.904324
C  -0.822827 0.919027 -1.18176
C  1.438198 1.102359 -0.183773
C  -2.293271 0.60784 -0.825119
C  1.032602 -3.356382 0.693482
C  0.008387 -1.515572 2.123563
C  -2.746517 1.207187 0.524383
C  1.338765 2.300403 0.784201
C  1.128961 -1.475344 -1.602095
C  -4.210639 0.861043 0.869619
C  1.780703 -1.648595 -2.636877
H  -0.683521 -1.55777 -0.525133
H  1.916394 -1.423633 1.09442
H  -0.688012 2.01746 -1.164791
H  -0.608263 0.587811 -2.22696
H  1.739076 1.464391 -1.198732
H  2.257175 0.449503 0.163047
H  -2.462145 -0.488615 -0.814393
H  -2.932737 1.00352 -1.641308
H  1.444152 -3.834473 1.601093
H  1.697546 -3.596681 -0.154499
H  0.042755 -3.811387 0.493468
H  -0.995925 -1.966466 1.999575
H  0.452303 -1.93057 3.046962
H  -0.121538 -0.427345 2.247608
H  -2.623619 2.309663 0.491196
H  -2.070276 0.841736 1.319993
H  1.195582 1.944105 1.816247
H  0.480704 2.953786 0.518294
H  -4.352363 -0.234174 0.943101
H  -4.513311 1.30489 1.835866
H  -4.905213 1.236238 0.093728
H  2.784997 3.412999 -0.08877
H  2.352685 -1.825975 -3.529469
