program: Gaussian 09
title: 000274560
version: EM64L-G09RevD.01
frameworkgroup: C1[X(C19H18N2O2)]
method: RPBEPBE
basis: SDD
operation: Freq
keyword: #p
keyword: freq=noraman
keyword: PBEPBE/SDD
title: #p freq=noraman PBEPBE/SDD
converged: NO YES NO NO
title: Mulliken charges:
elementType: O O N N C C C C C C C C C C C C C C C C C C C H H H H H H H H H H H H H H H H H H
charge: -0.226646 -0.226659 -0.224818 -0.224896 -0.367831 -0.387344 0.122167 0.121785 0.309401 0.309514 -0.354192 0.234784 0.234746 -0.350936 -0.366218 -0.366190 -0.362636 -0.362643 -0.239136 -0.239253 -0.696643 -0.269799 -0.269744 0.289998 0.229392 0.229651 0.207650 0.207064 0.197419 0.197563 0.311309 0.311391 0.222991 0.223002 0.234963 0.234969 0.211984 0.211989 0.217548 0.232161 0.232146
chargesum: 0.00000
title: Mulliken charges with hydrogens summed into heavy atoms:
elementType: O O N N C C C C C C C C C C C C C C C C C C C
charge: -0.226646 -0.226659 -0.224818 -0.224896 -0.077833 0.071698 0.122167 0.121785 0.309401 0.309514 0.060522 0.234784 0.234746 0.044046 -0.054909 -0.054799 -0.139645 -0.139641 -0.004173 -0.004285 -0.055122 -0.037638 -0.037598
polarizability: 2.75171108e+02 -2.00549119e-02 2.85761952e+02 -4.68967490e+01 -3.94789665e-02 1.39141910e+02
1716.lowfreq: -7.4586 -1.7401 -0.6912 0.0004 0.0008 0.0009 17.8810 24.2607 49.9504
frequency: 17.8046 24.2546 49.9180 58.6503 71.6907 110.3853 111.8181 115.5139 121.7932 190.3704 198.5011 234.9074 246.6895 256.8822 271.7005 276.9283 332.2324 339.3149 344.9892 374.9603 403.9005 424.8698 436.9061 463.5015 472.5236 480.5330 534.3811 562.6333 574.1903 592.8743 612.4380 632.8628 655.4331 695.7820 727.6614 731.5590 735.6823 742.9141 768.8507 785.0056 786.5758 794.5584 858.3597 868.4002 881.1853 886.8231 907.3455 912.2612 957.0419 964.2759 978.9340 988.3377 993.9858 998.5038 999.8769 1048.7544 1054.5121 1060.7412 1084.0542 1101.5809 1102.0468 1102.2261 1126.4409 1136.0826 1169.0637 1181.6022 1188.2025 1193.9385 1207.1690 1226.6088 1241.0217 1267.4882 1282.5126 1288.0289 1291.9265 1305.1895 1312.7781 1316.9901 1338.3377 1340.1919 1362.6466 1375.1561 1385.1787 1390.2814 1437.8855 1447.7184 1451.2528 1467.5470 1476.2588 1478.9887 1482.7596 1487.5601 1507.2433 1579.5936 1597.5272 1605.2087 1608.0592 1619.2515 1651.5704 2962.5300 2971.0832 2973.3693 2995.1127 3003.5649 3009.3840 3029.0995 3062.8828 3071.1297 3072.8823 3138.1468 3139.9064 3152.0464 3157.5300 3169.6901 3174.2842 3197.2849 3197.4866
redmass: 4.9184 4.7410 3.4097 1.7692 4.3085 2.9130 5.2181 6.1734 3.5485 2.4227 3.8712 1.2498 4.8451 3.9189 4.8699 5.8091 11.0228 7.4266 7.9928 3.0828 6.7351 3.4139 5.4116 6.1401 3.9099 4.2526 3.8985 3.7097 9.3070 4.8645 7.0728 7.4117 6.2844 2.4906 4.1962 6.0198 1.1816 1.9679 1.2602 1.8949 5.6805 1.4112 8.2904 3.8376 1.5515 1.3330 1.9743 1.6437 1.3872 1.3607 2.0777 3.6343 7.2654 1.3182 1.3091 3.2030 2.0486 2.4569 2.9072 2.1762 1.9663 2.4096 3.6235 1.5295 1.7479 1.1327 1.0816 1.5309 1.4664 3.7517 1.4933 2.1016 1.4123 1.8983 1.1698 1.1231 1.9101 3.9167 1.4383 3.2041 1.5595 9.3782 7.0245 1.2153 2.5554 2.5818 1.0874 1.0691 1.0692 1.0418 2.5533 1.0806 2.9511 6.7236 7.6351 5.6294 6.7103 11.2032 11.0343 1.0581 1.0595 1.0362 1.0625 1.0992 1.0782 1.1034 1.1040 1.1013 1.0993 1.0858 1.0861 1.0919 1.0913 1.0991 1.0961 1.0954 1.0954
irintensity: 0.0312 1.1061 0.0029 0.0298 1.0927 0.0474 1.6422 5.5800 0.0765 0.0402 2.7705 0.2827 1.3754 2.7444 0.0142 1.1374 7.9557 0.1782 1.2156 1.5366 0.5445 6.3038 3.2790 8.9837 0.8598 0.8875 2.9599 0.0810 22.4289 0.3434 4.2823 0.5309 0.2968 2.4858 7.9797 0.5042 6.9996 0.0867 175.5876 0.0081 5.2478 0.1664 2.0177 0.1202 0.0166 3.7280 11.2929 1.2169 0.0121 8.1052 0.3726 7.2966 3.3936 0.0074 4.8787 0.4654 14.3393 5.3076 5.9471 1.8321 0.9342 8.6278 16.4824 0.1136 3.5415 8.5326 0.8949 13.8300 1.4833 184.2500 0.5614 25.2866 34.8922 14.9739 3.8530 0.0016 0.2069 291.2947 13.0092 17.5464 2.2251 0.2065 6.9962 10.1281 135.8751 2.9846 15.6235 0.2597 4.1563 13.0422 72.0734 15.6095 27.4903 2.4612 2.8006 43.8148 16.8839 249.7735 260.0382 2.0272 52.4106 33.0707 45.5755 0.2442 8.6582 15.0397 3.4841 82.7212 56.3684 0.7732 3.3468 26.5458 0.4443 17.0970 30.5226 8.5793 12.4082
temp: 298.150 k
press: 1.00000 atm
elementType: 8 8 7 7 6 6 6 6 6 6 6 6 6 6 6 6 6 6 6 6 6 6 6 1 1 1 1 1 1 1 1 1 1 1 1 1 1 1 1 1 1
symmnumber: 1
zpe: 857823.3 jmol-1
zpe.correction: 0.326728 hartree
zpe.thermalcorrener: 0.346369 hartree
zpe.thermalcorrenthalpy: 0.347313 hartree
zpe.thermalcorrgfe: 0.277069 hartree
zpe.sumelectzpe: -993.164779 hartree
zpe.sumelectthermal: -993.145138 hartree
zpe.sumelectthermalent: -993.144193 hartree
zpe.sumelectthermalfe: -993.214437 hartree
dipole: -2.2898 0.0026 1.4478
dipole: 2.7091
quadrupole: -119.3311 -135.5495 -137.5249
quadrupole: -0.0211 -4.2214 -0.0281
quadrupole: 11.4707 -4.7477 -6.7231 -0.0211 -4.2214 -0.0281
hfenergy: -993.4915062 hartree
pointgroup: C01 [X(C19H18N2O2)]
dipole: 0.9363542 0.0327021 0.5081111 debye
polarizability: 280.7627141|0.980211|285.6753601|37.4998663|-3.6594143|133.6368964 unknown
InChI: InChI=1S/C19H18N2O2/c1-2-3-8-15-18(22)20-16-11-6-4-9-13(16)14-10-5-7-12-17(14)21(20)19(15)23/h4-7,9-12,15H,2-3,8H2,1H3
charge 0 multiplicity 1
41 atoms
O  -1.637585 -2.48103 -1.081771
O  -1.730125 2.365199 -1.225811
N  -0.0946 -0.738163 -0.604319
N  -0.122216 0.713821 -0.647879
C  -2.231589 -0.074732 -1.3692
C  -3.585499 -0.077176 -0.605184
C  -1.336328 -1.257614 -1.020288
C  -1.382335 1.15998 -1.092048
C  1.076275 -1.432814 -0.178775
C  1.019643 1.477126 -0.263192
C  -3.443108 -0.037242 0.931464
C  2.2295 -0.684167 0.209075
C  2.20048 0.797862 0.16679
C  -4.815001 -0.036881 1.643211
C  1.077815 -2.851031 -0.147514
C  0.965332 2.893774 -0.313226
C  3.373759 -1.410427 0.625624
C  3.314232 1.591267 0.541467
C  2.235618 -3.535856 0.272888
C  2.094289 3.646598 0.067296
C  -4.689535 0.000562 3.181261
C  3.388193 -2.818386 0.661282
C  3.273209 2.998448 0.496386
H  -2.451733 -0.111027 -2.454367
H  -4.136563 -0.987737 -0.908091
H  -4.163837 0.800173 -0.9522
H  -2.857073 -0.913201 1.276891
H  -2.879393 0.869148 1.232971
H  -5.383301 -0.939267 1.338642
H  -5.404575 0.836272 1.296877
H  0.1817 -3.394232 -0.449335
H  0.049175 3.382967 -0.645592
H  4.274535 -0.870077 0.929421
H  4.234671 1.105212 0.876388
H  2.22945 -4.630577 0.294138
H  2.045067 4.739655 0.025955
H  -4.152479 0.908922 3.51352
H  -4.128387 -0.876729 3.554669
H  -5.682355 -0.001599 3.667205
H  4.288857 -3.347679 0.988326
H  4.15152 3.580655 0.792942
