program: Gaussian 09
title: 000274530
version: EM64L-G09RevD.01
frameworkgroup: C1[X(C19H14O)]
method: RPBEPBE
basis: SDD
operation: Freq
keyword: #pfreq=noraman
keyword: PBEPBE/SDD
title: #p freq=noraman PBEPBE/SDD
converged: NO YES NO NO
title: Mulliken charges:
elementType: O C C C C C C C C C C C C C C C C C C C H H H H H H H H H H H H H H
charge: -0.214058 -0.062058 0.371622 0.311826 0.318764 -0.545056 -0.384805 0.368184 -0.363832 -0.374099 -0.375134 -0.374275 -0.374990 -0.225296 -0.223769 -0.225263 -0.223812 -0.238545 -0.238618 -0.241596 0.271783 0.260486 0.270828 0.237678 0.236296 0.237802 0.236197 0.231686 0.231300 0.231693 0.231294 0.233291 0.232913 0.171565
chargesum: 0.00000
title: Mulliken charges with hydrogens summed into heavy atoms:
elementType: O C C C C C C C C C C C C C C C C C C C
charge: -0.214058 -0.062058 0.371622 0.311826 0.318764 -0.273274 -0.124320 0.368184 -0.093004 -0.136422 -0.138838 -0.136473 -0.138793 0.006390 0.007530 0.006431 0.007482 -0.005254 -0.005705 -0.070031
polarizability: 2.71141416e+02 3.67148928e+00 2.17461693e+02 -6.85664481e-02 -1.91994540e-02 1.55856947e+02
1716.lowfreq: -63.4771 -50.9958 -8.6488 -0.0010 -0.0010 -0.0008 3.5704 6.8162 46.7249
frequency: -63.4584 -50.9898 46.6980 49.4119 52.5614 81.7527 110.7361 157.5569 212.3099 213.4590 246.4906 249.5771 250.9281 311.8424 325.3288 387.6549 393.3815 474.6332 479.5687 543.8571 588.3513 604.2174 612.1999 622.8066 627.0276 659.0737 696.9244 705.8892 714.2350 720.6797 750.8203 758.1251 772.5770 834.1580 846.1062 850.0123 857.8006 892.2390 913.5891 918.9026 921.8308 947.7861 951.5604 971.1012 975.0945 979.9250 986.3181 987.7494 995.4894 996.7233 1025.5958 1028.7012 1074.4529 1079.0487 1082.8797 1149.0747 1173.8703 1174.3015 1187.2904 1190.6367 1193.6247 1227.6982 1273.4176 1301.2016 1309.4366 1314.9526 1349.6170 1362.3760 1368.6489 1389.8082 1423.2431 1428.5524 1473.2659 1475.4299 1504.5874 1555.1475 1578.6162 1582.5622 1593.3548 1603.6276 1605.7090 1635.0117 2869.4617 3125.5390 3126.3970 3128.9479 3131.2743 3141.4307 3143.1159 3151.0317 3152.2291 3167.0696 3167.5038 3189.7213 3191.0269 3216.8118
redmass: 3.7069 3.9089 6.5482 5.5182 6.1479 3.5571 5.2503 6.1223 4.8149 4.1259 4.2584 4.9949 5.8709 2.7741 4.9929 2.8059 2.8451 3.6995 4.9239 4.0108 3.2492 3.8302 6.4621 5.4896 4.9255 5.6147 1.8681 1.7260 4.9986 4.1886 1.7706 2.1748 1.3358 4.1790 1.2525 1.3734 1.4528 2.8749 3.6798 1.7054 1.8249 1.3197 2.7742 1.3907 1.3829 1.8179 6.2660 6.1904 1.3177 1.3160 2.3042 2.0443 1.6342 1.1284 1.6164 2.0006 1.0525 1.0520 1.1139 1.1258 1.8387 3.2515 2.8960 1.4427 4.2433 1.3670 2.2138 5.1559 6.8476 1.7096 2.2023 2.2132 2.2510 2.3624 6.6212 6.8789 5.7968 5.9420 6.3696 6.1092 6.1251 9.6199 1.0849 1.0848 1.0847 1.0877 1.0878 1.0923 1.0925 1.0967 1.0968 1.1018 1.1018 1.0906 1.0947 1.1070
irintensity: 0.0013 0.0124 0.5157 0.5136 0.7783 0.2256 4.1547 7.2630 1.7768 7.2888 0.1336 0.2925 0.0391 5.0174 2.7977 0.0163 0.0021 2.8331 0.6026 17.3796 11.1724 4.7665 0.0063 20.4187 0.0342 11.1305 23.6432 79.5692 65.0853 5.0783 24.7173 66.7407 10.1895 3.9593 0.5579 13.0590 25.2513 4.1129 0.3009 3.4439 2.0420 0.2632 38.0396 0.0157 0.0710 7.5171 2.3201 4.2698 0.0007 0.6147 14.5259 9.2488 0.0089 13.3260 21.5660 33.8087 0.0008 0.0578 0.5158 1.3034 2.9530 17.1384 13.3465 0.0044 32.4741 1.9222 17.5346 0.0000 0.0057 4.1320 0.0165 16.5971 6.6499 10.2303 30.0792 21.9148 0.0083 4.1744 461.4651 6.0159 15.7638 9.3917 122.1515 5.0250 0.8822 0.0004 0.1065 19.0402 5.8739 0.7508 60.0580 29.9345 18.1059 0.5981 1.1308 4.8662
temp: 298.150 k
press: 1.00000 atm
elementType: 8 6 6 6 6 6 6 6 6 6 6 6 6 6 6 6 6 6 6 6 1 1 1 1 1 1 1 1 1 1 1 1 1 1
symmnumber: 1
zpe: 693022.8 jmol-1
zpe.correction: 0.263958 hartree
zpe.thermalcorrener: 0.278914 hartree
zpe.thermalcorrenthalpy: 0.279859 hartree
zpe.thermalcorrgfe: 0.220746 hartree
zpe.sumelectzpe: -806.241652 hartree
zpe.sumelectthermal: -806.226696 hartree
zpe.sumelectthermalent: -806.225751 hartree
zpe.sumelectthermalfe: -806.284864 hartree
dipole: 5.9910 1.9591 0.0010
dipole: 6.3031
quadrupole: -145.8503 -103.0032 -105.9546
quadrupole: -13.0618 -0.0252 -0.0072
quadrupole: -27.5809 15.2662 12.3147 -13.0618 -0.0252 -0.0072
hfenergy: -806.50561 hartree
pointgroup: C01 [X(C19H14O1)]
dipole: 2.2664334 1.0064402 -0.0001392 debye
polarizability: 269.8435846|9.0255655|218.759487|-0.0901992|-0.0334371|155.856984 unknown
InChI: InChI=1S/C19H14O/c20-14-15-11-12-18(13-15)19(16-7-3-1-4-8-16)17-9-5-2-6-10-17/h1-14H
charge 0 multiplicity 1
34 atoms
O  -5.620372 -1.484615 0.000592
C  0.269365 -0.026492 -0.000169
C  -0.980486 -0.614992 0.000015
C  0.439771 1.467863 -0.000126
C  1.525869 -0.852293 -0.000154
C  -2.27654 0.091413 0.000085
C  -1.287027 -2.067818 0.000141
C  -3.282626 -0.869293 0.000306
C  -2.655875 -2.21769 0.000345
C  0.5347 2.181521 -1.223412
C  2.131813 -1.239489 1.223398
C  0.531072 2.181745 1.223304
C  2.13341 -1.237286 -1.223609
C  0.717106 3.582822 -1.221837
C  3.324806 -1.996692 1.222017
C  0.713531 3.583042 1.222018
C  3.326383 -1.994517 -1.222034
C  0.809734 4.287978 0.000167
C  3.927469 -2.374475 0.000044
C  -4.721119 -0.593155 0.000444
H  -2.399467 1.176351 -0.000022
H  -0.531436 -2.85434 0.000091
H  -3.230124 -3.145498 0.000483
H  0.45727 1.641075 -2.173621
H  1.664955 -0.955325 2.173268
H  0.450851 1.641441 2.173363
H  1.667786 -0.951459 -2.173585
H  0.78346 4.121583 -2.173572
H  3.779368 -2.293408 2.173749
H  0.777132 4.121968 2.173848
H  3.782162 -2.28956 -2.173703
H  0.952524 5.374142 0.000279
H  4.85269 -2.961135 0.00012
H  -4.993951 0.493085 0.000263
