program: Gaussian 09
title: 000274517
version: EM64L-G09RevD.01
frameworkgroup: C1[X(C15H19NO2)]
method: RPBEPBE
basis: SDD
operation: Freq
keyword: #p
keyword: freq=noraman
keyword: PBEPBE/SDD
title: #p freq=noraman PBEPBE/SDD
converged: YES YES NO NO
title: Mulliken charges:
elementType: O O N C C C C C C C C C C C C C C C H H H H H H H H H H H H H H H H H H H
charge: -0.314434 -0.274284 -0.460264 -0.170652 -0.120984 -0.009485 -0.514129 -0.508097 -0.489066 -0.451707 -0.406769 0.253258 0.480201 -0.443635 -0.356452 -0.195830 -0.210485 -0.257893 0.248972 0.231103 0.224945 0.231063 0.223553 0.205144 0.218238 0.227679 0.205598 0.200567 0.226012 0.248114 0.229392 0.328564 0.221898 0.299314 0.226035 0.226001 0.228517
chargesum: 0.00000
title: Mulliken charges with hydrogens summed into heavy atoms:
elementType: O O N C C C C C C C C C C C C C C C
charge: -0.314434 -0.274284 -0.131701 0.078321 0.110119 0.215460 -0.059513 -0.084715 -0.055789 -0.025129 0.070738 0.253258 0.480201 -0.221736 -0.057138 0.030205 0.015516 -0.029376
polarizability: 2.40836821e+02 1.98989266e+01 1.36779837e+02 -1.35002930e+01 1.78250220e+01 1.39811273e+02
1716.lowfreq: -20.9845 -7.4737 -3.1195 -0.0011 -0.0010 -0.0004 15.3947 18.4826 34.8945
frequency: 15.1974 17.0765 34.8255 66.3611 81.1983 99.1898 143.7368 180.1239 217.3079 248.5573 263.0825 299.8199 343.1958 371.7465 408.4639 412.8322 437.8502 478.7488 509.5159 570.9464 605.4223 617.4637 639.2606 676.8257 694.0967 698.0079 728.8459 760.7550 766.1283 790.9794 808.2093 824.4001 841.0584 858.6531 873.1955 890.4865 908.9148 913.3058 926.7026 935.3670 951.8093 961.7891 971.4933 976.5693 984.4350 995.9968 1003.5454 1018.6820 1030.3758 1037.9499 1055.6452 1090.0042 1107.0267 1109.8407 1137.1805 1155.1696 1159.3892 1166.6091 1172.5285 1190.0213 1205.0009 1211.0475 1241.8091 1256.3886 1259.0222 1263.4826 1267.4053 1286.3046 1290.6973 1307.9943 1312.4813 1325.9403 1344.2883 1360.4677 1386.2283 1433.2420 1455.7331 1465.4209 1473.0125 1474.6977 1486.2242 1494.4555 1516.5860 1600.5304 1617.7534 1664.3150 2980.0128 2991.6037 3004.4743 3005.8973 3009.6022 3010.3464 3044.3446 3053.8277 3058.5277 3069.3715 3073.2516 3077.4433 3080.7550 3113.0572 3131.8489 3144.0274 3164.9745 3189.6540 3542.6152
redmass: 3.8754 4.8008 3.7340 7.7143 4.9101 3.5917 3.8616 3.7156 4.3428 3.6568 2.6844 3.1768 6.2923 2.1891 2.9239 2.5705 2.5016 2.6285 2.8401 3.4469 5.5000 5.9901 1.3201 6.7049 3.2121 2.6417 3.2875 4.1081 1.6772 2.1871 1.7200 4.4836 1.2671 2.2556 1.9313 5.6752 2.0857 1.4306 2.9678 2.4162 2.0238 1.5381 1.3534 1.8187 5.7026 1.3034 4.8832 1.7578 2.1101 1.5788 1.5854 1.5602 1.5129 1.1340 1.1746 2.3701 3.0696 1.6856 1.0508 1.1121 1.7439 1.2258 1.3119 1.4069 2.0117 1.4330 1.3468 1.4809 1.5121 1.5183 1.4757 1.4033 1.3439 1.4072 6.7892 2.3649 1.0953 1.0835 1.0862 1.0902 2.2088 1.1002 2.2676 5.3228 6.0111 8.1556 1.0634 1.0585 1.0788 1.0615 1.0640 1.0602 1.1041 1.1002 1.0887 1.1028 1.0937 1.1057 1.1075 1.0883 1.0869 1.0935 1.0996 1.0953 1.0759
irintensity: 0.7970 0.3246 0.4779 3.0842 1.1570 0.2579 2.2641 1.0808 1.2945 1.9973 2.5055 17.0012 6.2323 2.5832 0.0350 7.5746 3.2193 4.4434 26.1511 0.1069 0.0634 1.8971 28.3969 13.7966 1.2181 82.1876 1.0621 0.7901 105.5788 2.9261 7.5935 6.6474 0.4862 1.8424 3.1274 6.0567 1.8939 13.7630 4.3464 9.0843 2.1225 0.6392 0.0645 30.7808 5.7607 2.4430 303.4106 18.3020 20.6995 1.6875 9.2233 31.2626 13.2857 1.7218 3.7167 45.0548 387.3660 2.0879 0.7695 4.5501 5.8661 6.0330 7.0158 1.1323 5.0020 1.7394 0.4267 1.3759 7.1083 2.6117 1.1320 57.2603 0.8643 1.6893 52.6409 118.7427 14.1596 3.0900 9.8747 18.3284 11.3199 5.9136 551.6038 32.2322 109.9439 214.1378 39.1173 30.9105 25.8465 79.9610 48.6771 12.0196 5.8331 28.0892 91.3909 39.0015 17.7918 84.4553 7.2003 13.9692 0.6719 31.6903 24.3339 6.0863 28.8997
temp: 298.150 k
press: 1.00000 atm
elementType: 8 8 7 6 6 6 6 6 6 6 6 6 6 6 6 6 6 6 1 1 1 1 1 1 1 1 1 1 1 1 1 1 1 1 1 1 1
symmnumber: 1
zpe: 819322.8 jmol-1
zpe.correction: 0.312064 hartree
zpe.thermalcorrener: 0.327846 hartree
zpe.thermalcorrenthalpy: 0.328790 hartree
zpe.thermalcorrgfe: 0.265695 hartree
zpe.sumelectzpe: -786.868276 hartree
zpe.sumelectthermal: -786.852494 hartree
zpe.sumelectthermalent: -786.851550 hartree
zpe.sumelectthermalfe: -786.914645 hartree
dipole: 0.7674 1.2049 1.7032
dipole: 2.2230
quadrupole: -95.3091 -104.7961 -106.9661
quadrupole: 1.1882 -5.0396 3.3771
quadrupole: 7.0480 -2.4390 -4.6090 1.1882 -5.0396 3.3771
hfenergy: -787.18034 hartree
pointgroup: C01 [X(C15H19N1O2)]
dipole: 0.3067846 -0.4634938 0.6752461 debye
polarizability: 238.9601047|23.239279|129.659296|16.15589|-13.9750915|148.8085303 unknown
InChI: InChI=1S/C15H19NO2/c17-15(16-14-4-2-1-3-5-14)18-10-13-9-11-6-7-12(13)8-11/h1-5,11-13,16H,6-10H2
charge 0 multiplicity 1
37 atoms
O  0.419071 0.520208 1.456902
O  -0.467156 1.301119 -0.591882
N  -1.687834 -0.06282 0.917873
C  2.74268 -0.537181 -0.444693
C  4.799819 0.452933 -0.506156
C  2.826904 0.183717 0.941182
C  3.509103 0.44634 -1.376181
C  4.234155 0.89722 0.87554
C  3.720202 -1.749816 -0.408288
C  5.140608 -1.067261 -0.434368
C  1.713133 1.208513 1.189024
C  -0.584264 0.648175 0.475295
C  -2.951767 -0.203528 0.281993
C  -3.930061 -0.993233 0.94474
C  -3.262522 0.407182 -0.961932
C  -5.205856 -1.169882 0.37244
C  -4.545446 0.219537 -1.520211
C  -5.523509 -0.563748 -0.865579
H  1.716216 -0.795982 -0.750475
H  5.630593 1.081303 -0.868032
H  2.794461 -0.558728 1.761256
H  3.031139 1.438171 -1.46512
H  3.670128 0.038937 -2.390339
H  4.891967 0.606504 1.714087
H  4.12056 1.999278 0.909203
H  3.572852 -2.39424 -1.294077
H  3.566521 -2.377387 0.48844
H  5.744492 -1.308974 0.459378
H  5.719868 -1.382301 -1.321579
H  1.576658 1.886139 0.326615
H  1.914798 1.798001 2.100847
H  -1.561589 -0.525671 1.820703
H  -3.690762 -1.466114 1.906083
H  -2.508752 1.012724 -1.469183
H  -5.950512 -1.780886 0.894552
H  -4.779776 0.694081 -2.479835
H  -6.514823 -0.700232 -1.310326
