program: Gaussian 09
title: 000026551
version: EM64L-G09RevD.01
frameworkgroup: C1[X(C19H13ClN2O6S)]
method: RPBEPBE
basis: SDD
operation: Freq
keyword: #p
keyword: freq=noraman
keyword: PBEPBE/SDD
title: #p freq=noraman PBEPBE/SDD
converged: YES YES NO NO
title: Mulliken charges:
elementType: Cl S O O O O O O N N C C C C C C C C C C C C C C C C C C C H H H H H H H H H H H H H
charge: -0.029983 0.870824 -0.532818 -0.529129 -0.338417 -0.247779 -0.199170 -0.201318 -0.457980 0.022229 -0.095548 -0.062820 -0.211005 -0.229558 0.502818 -0.433133 -0.322133 -0.227959 -0.225935 -0.186309 -0.186570 -0.101325 0.248212 0.432503 -0.538481 0.412722 -0.314255 -0.374638 -0.167443 0.283802 0.279698 0.240201 0.306397 0.286108 0.285815 0.268322 0.268611 0.345733 0.310653 0.313032 0.290935 0.245091
chargesum: 0.00000
title: Mulliken charges with hydrogens summed into heavy atoms:
elementType: Cl S O O O O O O N N C C C C C C C C C C C C C C C C C C C
charge: -0.029983 0.870824 -0.532818 -0.529129 -0.338417 -0.247779 -0.199170 -0.201318 -0.112246 0.022229 -0.095548 -0.062820 0.072797 0.050140 0.502818 -0.192932 -0.015737 0.058149 0.059880 0.082013 0.082041 -0.101325 0.248212 0.432503 -0.227828 0.412722 -0.001223 -0.083703 0.077648
polarizability: 4.46814888e+02 -1.71467468e+00 1.94748688e+02 4.36452274e+00 7.51779088e+00 2.64978322e+02
1716.lowfreq: -0.0018 -0.0015 -0.0010 2.1485 2.3921 5.1176 9.2620 12.1929 26.7111
frequency: 6.6147 11.6988 26.7088 31.6947 35.8713 46.8498 53.4213 71.6046 73.2267 94.8292 103.4871 123.1754 144.7492 161.0877 166.5375 181.8210 207.0646 229.7180 243.4349 248.9422 262.8832 288.5136 307.5896 322.3332 333.4710 360.8262 396.1725 399.8594 406.4075 411.2058 413.7829 426.6505 431.1816 489.6121 504.8781 517.4863 524.1972 536.1658 554.9012 612.3241 617.9877 641.0718 650.5079 670.0433 672.7119 699.3518 700.6606 706.0900 706.9400 709.1958 730.0560 750.1962 784.3262 814.8588 833.9399 835.3096 838.6452 841.5665 866.8007 873.4662 926.0417 926.1089 947.8471 959.1905 964.7821 973.0319 975.0431 984.5127 989.3043 991.2181 991.9850 1001.9465 1049.0287 1058.7554 1066.3615 1074.5212 1086.3123 1104.7030 1123.3326 1145.4526 1173.9598 1175.8885 1187.1737 1191.9975 1218.3591 1263.4932 1277.9778 1280.8112 1299.6345 1376.8195 1377.5745 1380.4069 1383.3241 1394.1301 1406.8930 1440.8690 1451.2271 1465.6140 1478.3036 1514.6099 1568.8704 1590.9410 1596.6315 1602.2351 1603.6570 1612.8163 1684.0991 3129.9152 3155.0253 3155.4513 3156.9568 3158.8069 3162.8553 3177.4228 3180.1215 3191.7263 3193.3281 3195.5279 3210.2317 3539.5678
redmass: 8.1944 9.8729 10.3211 4.8729 6.0866 6.3460 11.3994 8.2838 5.9363 9.8588 9.4885 10.4143 8.7715 6.6336 6.7241 8.7105 14.1736 10.0890 5.4272 9.3027 8.4121 7.6975 6.3897 7.7596 8.0497 6.0634 8.8992 9.1345 6.2914 2.9153 3.0029 9.3355 3.3641 5.3759 4.7878 5.6668 5.2583 3.2904 7.7779 7.1205 7.1413 7.4031 1.8762 8.2976 2.8776 5.4806 2.5529 6.0445 6.3314 4.5466 3.4297 10.1568 14.6868 1.3848 1.3295 3.6897 1.4278 1.4834 1.6532 4.6993 13.5875 1.5407 1.3667 1.3508 1.3947 1.3781 5.4955 6.2394 6.0812 1.4394 4.3076 1.3352 2.7058 2.4697 3.0682 1.8065 1.5342 1.3183 1.3652 3.4799 1.1301 1.3312 1.1317 3.0919 9.1576 2.0764 1.3604 1.2337 1.3583 7.2628 3.3510 6.9935 6.9023 8.2142 4.3287 3.0444 2.1427 2.5455 2.2313 2.2797 6.1418 7.6768 7.9320 6.2236 5.9488 6.7430 9.3803 1.0901 1.0899 1.0898 1.0906 1.0900 1.0954 1.0961 1.0971 1.0937 1.0940 1.0948 1.0954 1.0764
irintensity: 2.1646 0.0811 0.1721 2.3389 2.0956 1.5380 0.1728 0.6015 3.5810 3.2879 1.6268 2.5734 2.5622 0.8930 2.0633 3.4281 5.5252 1.9470 0.4373 0.2323 17.8756 1.2207 6.2403 13.6413 12.0808 6.4887 3.2703 24.2256 2.7478 0.0927 0.2251 45.4409 0.4753 2.2364 34.9740 37.7279 0.0384 70.0870 143.5072 0.3981 0.7099 9.5771 15.4934 4.5199 2.0093 51.4152 63.1831 16.6268 19.6421 22.8755 5.1253 46.0299 142.8427 44.4680 4.6816 8.3706 27.2814 31.0288 52.5822 37.1159 68.1084 36.1137 1.8903 0.1869 3.0695 1.6207 307.8931 31.1665 29.3261 5.3637 28.5188 3.3369 49.7703 25.1959 60.5096 4.3547 26.4476 6.1696 113.8898 842.8968 14.6264 2.7854 39.6566 510.6023 312.5276 0.9634 2.1433 2.5715 21.2978 43.4959 13.0411 169.9229 111.9753 4.6346 37.9559 52.7714 69.4587 417.2626 5.1169 615.3078 26.7986 18.9244 6.1159 183.6023 2.9455 4.4571 222.1509 11.3815 1.0887 2.4962 1.9949 8.2543 7.1336 0.2719 3.7109 1.0924 13.0772 3.9492 6.7418 36.8073
temp: 298.150 k
press: 1.00000 atm
elementType: 17 16 8 8 8 8 8 8 7 7 6 6 6 6 6 6 6 6 6 6 6 6 6 6 6 6 6 6 6 1 1 1 1 1 1 1 1 1 1 1 1 1
symmnumber: 1
zpe: 751562.5 jmol-1
zpe.correction: 0.286255 hartree
zpe.thermalcorrener: 0.312347 hartree
zpe.thermalcorrenthalpy: 0.313291 hartree
zpe.thermalcorrgfe: 0.224184 hartree
zpe.sumelectzpe: -2148.518349 hartree
zpe.sumelectthermal: -2148.492257 hartree
zpe.sumelectthermalent: -2148.491313 hartree
zpe.sumelectthermalfe: -2148.580420 hartree
dipole: -0.0313 3.2178 0.6399
dipole: 3.2810
quadrupole: -243.9901 -203.6419 -170.0574
quadrupole: -28.4744 26.2135 6.5765
quadrupole: -38.0936 2.2545 35.8391 -28.4744 26.2135 6.5765
hfenergy: -2148.804604 hartree
pointgroup: C01 [X(C19H13Cl1N2O6S1)]
dipole: 0.0168062 -1.2544172 -0.3040272 debye
polarizability: 446.9143859|0.3024222|212.9289695|1.7061747|-31.652246|246.6985425 unknown
InChI: InChI=1S/C19H13ClN2O6S/c20-13-4-8-17(9-5-13)29(26,27)18-10-6-14(7-11-18)21-19(23)28-16-3-1-2-15(12-16)22(24)25/h1-12,21H
charge 0 multiplicity 1
42 atoms
Cl 7.995339 -3.436307 -1.531948
S  4.664576 1.588818 0.811224
O  5.108714 2.880628 -0.093257
O  4.823932 1.513149 2.438968
O  -3.396653 0.148648 -0.488356
O  -2.088488 -0.534692 1.386546
O  -9.191974 -0.920155 -1.552275
O  -7.70369 0.176456 -2.887841
N  -1.23029 0.700962 -0.443446
N  -8.014221 -0.461209 -1.809487
C  2.840912 1.269814 0.426999
C  5.606874 0.098502 0.110977
C  2.313727 1.791386 -0.765214
C  2.062855 0.589314 1.375427
C  0.136405 0.872737 -0.102038
C  0.947477 1.584046 -1.029664
C  0.694109 0.380593 1.109659
C  6.100706 0.185141 -1.200144
C  5.835563 -0.997274 0.958164
C  6.836931 -0.90903 -1.708342
C  6.571994 -2.090728 0.448806
C  7.050083 -2.028607 -0.87695
C  -2.204636 0.041923 0.283802
C  -4.650063 -0.399397 -0.106522
C  -5.658233 -0.186368 -1.068025
C  -6.94682 -0.682421 -0.797422
C  -4.917369 -1.091216 1.100833
C  -7.259574 -1.377772 0.390691
C  -6.227491 -1.572128 1.329706
H  2.948853 2.365856 -1.447156
H  2.51016 0.253428 2.316738
H  0.50829 1.98084 -1.952702
H  0.06218 -0.147297 1.825846
H  5.94266 1.09104 -1.794394
H  5.477136 -0.9845 1.99263
H  7.242206 -0.886476 -2.723599
H  6.775841 -2.965652 1.072049
H  -1.550019 1.102052 -1.328377
H  -5.451362 0.347605 -1.998046
H  -4.12583 -1.248195 1.834036
H  -8.275767 -1.743507 0.554474
H  -6.437444 -2.107007 2.261132
