program: Gaussian 09
title: 000274490
version: EM64L-G09RevD.01
frameworkgroup: C1[X(C11H18O3)]
method: RPBEPBE
basis: SDD
operation: Freq
keyword: #pfreq=noraman
keyword: PBEPBE/SDD
title: #p freq=noraman PBEPBE/SDD
converged: YES YES NO NO
title: Mulliken charges:
elementType: O O O C C C C C C C C C C C H H H H H H H H H H H H H H H H H H
charge: -0.272276 -0.162356 -0.239733 0.199097 0.240469 -0.174287 0.027460 -0.731269 -0.710500 -0.732033 -0.732826 0.287049 -0.497212 -0.658075 0.265925 0.234742 0.216631 0.220967 0.226619 0.224698 0.225819 0.210316 0.250118 0.225048 0.222832 0.235774 0.235086 0.243420 0.242895 0.230074 0.216712 0.228816
chargesum: 0.00000
title: Mulliken charges with hydrogens summed into heavy atoms:
elementType: O O O C C C C C C C C C C C
charge: -0.272276 -0.162356 -0.239733 0.199097 0.240469 0.091638 0.027460 -0.058930 -0.033365 -0.046550 -0.039134 0.287049 -0.010897 0.017527
polarizability: 1.44899269e+02 1.78708464e+00 1.21777850e+02 -6.09733033e-01 2.51586228e+00 1.05296551e+02
1716.lowfreq: -4.3153 -0.0004 -0.0003 -0.0001 3.8279 12.1687 17.1104 41.4749 60.3967
frequency: 10.4784 41.2958 60.3903 68.1617 97.0174 149.0771 166.3233 179.1254 186.9227 190.9452 192.5061 207.7148 221.8075 241.2423 243.6978 256.3618 289.1787 293.3650 301.1314 341.4294 382.4063 538.2060 553.0590 570.2516 590.4995 641.4220 702.8281 712.2361 777.1512 791.2566 825.3755 849.4444 902.2264 951.2665 953.2943 964.7689 980.0421 995.4118 1009.9161 1014.9458 1026.9500 1075.8368 1081.3725 1084.3694 1126.7243 1159.3722 1183.7579 1194.8834 1208.4770 1241.5182 1252.3406 1261.4715 1330.7668 1349.1932 1369.5107 1375.5405 1391.2178 1393.6983 1399.6062 1443.1619 1457.2841 1460.5255 1463.6421 1467.7701 1471.9460 1474.4067 1480.6443 1481.0028 1482.1906 1488.1541 1641.9718 1707.3719 2977.6262 2980.8472 2985.9374 2990.9886 2995.8429 3000.6025 3040.5795 3043.1727 3073.3892 3076.0929 3083.5542 3083.7626 3090.0520 3091.1731 3092.9128 3098.0248 3098.6323 3102.9413
redmass: 1.9896 4.1710 8.2777 2.9652 3.3506 3.6824 2.2260 1.1838 1.2669 1.7314 1.0653 1.4467 2.0420 1.8423 2.9059 2.3536 2.7680 3.4158 2.8664 3.5400 2.6142 2.8491 4.3172 3.5011 3.3202 3.6683 3.7953 4.6480 3.5459 1.3663 3.2452 4.2528 3.3071 1.3999 1.3874 2.1606 1.2905 2.2521 1.9782 1.4929 2.0737 2.9449 2.7085 1.6478 3.0568 2.2920 2.3882 1.9153 4.1994 1.1764 2.9819 2.9985 1.4888 1.5173 1.1798 1.1804 1.1940 1.1956 1.2119 1.0857 1.0511 1.0471 1.0503 1.0487 1.0393 1.0572 1.0569 1.0514 1.0575 1.0562 9.4111 11.6109 1.0350 1.0348 1.0345 1.0346 1.0587 1.0388 1.0874 1.0982 1.1000 1.0994 1.1002 1.0999 1.1003 1.1003 1.1002 1.1004 1.0998 1.1003
irintensity: 0.3749 2.2715 2.9848 1.5856 1.5272 1.6670 0.2782 0.1236 0.0295 1.3413 0.5292 0.8996 2.5900 1.7516 4.6271 2.6974 2.1526 2.7805 4.3545 7.0090 1.7200 1.1310 1.2964 3.6133 0.5009 1.7938 1.5227 0.7099 0.3031 15.3676 5.4212 14.4536 7.2291 2.4353 6.8835 6.7999 4.6998 11.2698 84.3755 18.0371 77.5147 110.1711 42.5319 0.0794 271.1676 17.7612 4.8007 3.2852 4.7122 0.0281 5.9650 4.5152 38.0657 15.3615 2.0036 30.0483 20.2667 9.0864 18.7508 28.7037 1.7924 3.3389 18.1552 2.7092 11.5191 20.3994 3.4219 15.5569 2.9986 31.4541 135.4259 170.6899 25.2253 26.4515 18.5758 20.5610 24.1210 18.2731 11.2063 4.1772 26.4081 25.5206 17.7440 5.6306 19.4530 32.4630 33.9813 28.5917 25.4201 31.3751
temp: 298.150 k
press: 1.00000 atm
elementType: 8 8 8 6 6 6 6 6 6 6 6 6 6 6 1 1 1 1 1 1 1 1 1 1 1 1 1 1 1 1 1 1
symmnumber: 1
zpe: 702070.3 jmol-1
zpe.correction: 0.267404 hartree
zpe.thermalcorrener: 0.284565 hartree
zpe.thermalcorrenthalpy: 0.285509 hartree
zpe.thermalcorrgfe: 0.221589 hartree
zpe.sumelectzpe: -654.521851 hartree
zpe.sumelectthermal: -654.504690 hartree
zpe.sumelectthermalent: -654.503746 hartree
zpe.sumelectthermalfe: -654.567666 hartree
dipole: 2.3685 -1.9562 -0.2275
dipole: 3.0803
quadrupole: -94.2213 -83.0787 -84.4203
quadrupole: -0.4806 -8.4151 -2.0460
quadrupole: -6.9812 4.1614 2.8198 -0.4806 -8.4151 -2.0460
hfenergy: -654.7892555 hartree
pointgroup: C01 [X(C11H18O3)]
dipole: 0.9179973 -0.7852106 -0.0969909 debye
polarizability: 144.954606|1.3827257|121.6762192|-0.5795608|2.6688852|105.3428454 unknown
InChI: InChI=1S/C11H18O3/c1-6-7(12)14-9-10(2,3)8(13)11(9,4)5/h9H,6H2,1-5H3
charge 0 multiplicity 1
32 atoms
O  0.936802 -0.748663 -0.171783
O  -3.343525 0.643913 -0.704626
O  2.231484 0.822244 0.968952
C  -1.570443 -1.026431 0.122217
C  -0.877999 1.126269 -0.142427
C  -0.27345 -0.20267 0.473499
C  -2.195636 0.322258 -0.343711
C  -2.281783 -1.669011 1.331582
C  -1.419961 -2.039023 -1.037341
C  -0.991467 2.296813 0.855888
C  -0.248041 1.586102 -1.476518
C  2.154514 -0.147218 0.180836
C  3.307562 -0.841061 -0.525848
C  4.681945 -0.278213 -0.123589
H  -0.079016 -0.105889 1.555985
H  -3.290811 -2.012542 1.041748
H  -2.395331 -0.95734 2.169735
H  -1.706029 -2.540618 1.69434
H  -2.420528 -2.376774 -1.361039
H  -0.898286 -1.604525 -1.906576
H  -0.838027 -2.915528 -0.701434
H  -1.476873 1.986622 1.799642
H  0.018288 2.673355 1.097505
H  -1.591341 3.116913 0.422723
H  -0.105911 0.74916 -2.181863
H  0.735461 2.052803 -1.286487
H  -0.903584 2.335583 -1.954125
H  3.140276 -0.743475 -1.616412
H  3.236468 -1.924401 -0.311782
H  4.750799 0.799587 -0.349036
H  5.485075 -0.802729 -0.670354
H  4.859069 -0.399713 0.958698
