program: Gaussian 09
title: 000274538
version: EM64L-G09RevD.01
frameworkgroup: C1[X(C23H33NO2)]
method: RPBEPBE
basis: SDD
operation: Freq
keyword: #p
keyword: freq=noraman
keyword: PBEPBE/SDD
title: #p freq=noraman PBEPBE/SDD
converged: NO YES NO NO
title: Mulliken charges:
elementType: O O N C C C C C C C C C C C C C C C C C C C C C C C H H H H H H H H H H H H H H H H H H H H H H H H H H H H H H H H H
charge: -0.292662 -0.270648 -0.429298 0.327379 -0.153377 -0.327573 -0.097760 -0.598137 -0.486410 -0.217935 -0.514876 -0.801014 -0.503339 0.317198 0.230106 -0.578090 0.334122 -0.428089 -0.556576 0.319407 -0.396980 0.319253 -0.755963 -0.693183 -0.693796 -0.536577 0.200489 0.233926 0.204857 0.254131 0.242896 0.252820 0.197524 0.220836 0.216456 0.221652 0.212205 0.225747 0.211091 0.218232 0.201875 0.222155 0.221977 0.303804 0.234000 0.253966 0.237764 0.217234 0.228823 0.217151 0.271205 0.204763 0.202968 0.203155 0.203296 0.269047 0.218646 0.218347 0.241778
chargesum: 0.00000
title: Mulliken charges with hydrogens summed into heavy atoms:
elementType: O O N C C C C C C C C C C C C C C C C C C C C C C C
charge: -0.292662 -0.270648 -0.125494 0.327379 0.047112 -0.093647 0.107098 -0.101110 -0.036066 0.002901 -0.076769 -0.151971 -0.083233 0.317198 0.230106 -0.133958 0.334122 -0.194089 -0.302610 0.319407 -0.159216 0.319253 -0.092755 -0.014247 -0.018298 0.142194
polarizability: 3.49572754e+02 -1.04126429e+01 2.43179453e+02 -1.10356513e+00 1.86644624e+00 1.85671201e+02
1716.lowfreq: -5.5279 -4.5070 -2.6097 -0.0009 -0.0008 0.0009 13.2296 25.8439 33.9942
frequency: 12.0302 25.8199 33.7860 43.2752 63.3332 84.6854 103.7742 118.9909 133.8197 144.2006 162.7080 169.1878 181.0418 198.5610 204.0943 217.2614 222.2873 232.5154 245.2738 254.4793 261.3170 269.3613 286.5717 297.3489 314.5903 325.9842 331.7354 362.7502 369.9416 388.3012 399.6095 405.9747 412.6913 443.3842 448.2048 471.3221 478.7503 506.1505 527.0818 534.3667 569.8476 579.3440 588.7377 608.6943 622.8381 661.0936 709.4532 719.2116 725.3828 744.0124 758.2119 781.7495 808.5361 815.7709 837.6599 857.1833 864.3338 883.9783 894.2336 905.2387 913.1594 915.1869 925.5304 931.7629 934.1667 948.5352 957.0617 962.9330 981.2260 996.0181 1003.4428 1016.2015 1032.4040 1037.0761 1040.4579 1051.2004 1060.6664 1071.1683 1090.2632 1111.0464 1111.1373 1126.4462 1131.2426 1142.2708 1143.9677 1160.6662 1168.6349 1174.9900 1188.3662 1192.5817 1197.1138 1205.6005 1222.6293 1228.4266 1231.9080 1234.6056 1238.3700 1256.4678 1260.4993 1263.9909 1275.7202 1290.5463 1301.9624 1313.8056 1320.3184 1324.2064 1334.2291 1344.6663 1349.5723 1360.7612 1368.7508 1372.9550 1376.1772 1383.0351 1384.7317 1397.4317 1423.9467 1436.0124 1448.2091 1454.3965 1455.4011 1461.2501 1463.9931 1464.1761 1466.7609 1468.3485 1472.2688 1472.8030 1474.7200 1481.4396 1483.6638 1485.1466 1488.1704 1494.4719 1502.0917 1580.3023 1600.5463 1623.6144 2936.0002 2953.6772 2954.0980 2955.0254 2957.1661 2964.1195 2971.2566 2972.7296 2978.1799 2980.8140 2983.9179 2985.2815 2985.9040 3018.5036 3020.4491 3028.5349 3034.9393 3039.4716 3042.5544 3047.2645 3058.5341 3062.4695 3074.9967 3079.3088 3091.2753 3093.0713 3102.7021 3107.1310 3110.2640 3120.0259 3137.6900 3159.5307 3527.9510
redmass: 3.7118 4.1186 3.3558 3.8562 3.8305 3.4832 3.7611 3.5140 3.9896 4.2788 2.6304 2.9691 3.8839 1.0323 1.9316 1.3222 2.5532 2.0564 1.5861 1.0653 1.0500 2.4819 2.7380 3.3561 3.0247 3.6477 2.5086 2.3063 3.1969 3.4655 3.0935 2.7984 3.1294 3.2422 2.7571 2.6886 3.9478 3.2170 1.4682 2.4449 2.9085 2.9325 3.8394 3.0814 3.5998 2.6763 4.6172 3.2526 3.8469 4.5104 3.2882 2.1669 1.6706 2.6483 2.7060 1.8697 2.5173 1.8384 1.7718 2.4090 2.6378 1.7000 1.6685 2.7314 1.3687 1.2101 2.4630 1.7012 1.9773 2.3238 4.1962 1.9407 1.3851 1.7864 1.7158 2.0169 2.3316 1.8342 1.9728 1.7275 1.3433 1.8937 1.5534 1.5389 2.2615 1.6860 1.4102 1.4735 1.7206 1.6262 1.6442 1.5203 1.5812 1.5781 2.4458 3.0231 2.0947 2.5078 1.9951 1.7777 1.5046 1.3993 1.3469 1.4250 1.5734 1.5075 1.4591 1.6289 1.3622 1.7580 1.2083 1.2271 1.6456 3.7309 1.3284 1.2240 2.9073 1.2972 1.0525 1.3827 1.1191 1.0870 1.0881 1.0513 1.0562 1.0728 1.0511 1.0559 1.0757 1.0840 1.0615 1.0879 1.3341 2.5180 1.0631 7.1812 5.5457 6.8908 1.0817 1.0453 1.0689 1.0661 1.0369 1.0830 1.0365 1.0612 1.0614 1.0355 1.0747 1.0406 1.0667 1.0939 1.0596 1.0994 1.1025 1.1037 1.1010 1.0982 1.0982 1.1002 1.1001 1.0994 1.0977 1.1066 1.1002 1.0995 1.0890 1.0990 1.0913 1.0935 1.0772
irintensity: 1.3301 0.4511 0.2663 0.7873 2.5427 5.0809 1.5287 3.9058 2.6137 1.9635 0.6016 2.4926 0.2735 0.2201 2.9913 2.3348 2.7799 0.4790 0.6252 0.0722 0.0409 4.7430 3.9846 0.1665 8.7179 1.9749 0.5237 0.8203 1.7620 3.4409 0.2820 0.3982 0.9860 2.1862 5.2869 1.1526 3.2356 7.8533 43.5748 28.2050 6.2462 6.0756 0.8859 2.8500 0.6178 2.9664 4.7432 1.4822 1.9716 3.1164 1.7432 11.1034 22.6128 7.4342 0.8365 9.5276 1.4336 5.5789 18.4598 1.9152 5.3679 0.3297 5.1283 3.7619 0.1081 0.6948 15.8515 2.0535 2.3110 11.9480 51.5130 11.6501 0.0488 1.6450 2.1432 2.6488 6.3677 5.8398 2.9211 3.6181 0.6365 31.9832 20.0624 24.4608 6.7607 5.5389 3.9282 41.7374 40.5463 3.6302 4.8510 4.4613 8.9901 3.4401 89.0354 21.9338 90.8307 52.9615 29.8170 59.7655 2.5542 2.5503 3.0727 2.3168 0.1089 1.5505 4.1941 8.1470 20.8587 1.7769 31.0692 40.8637 2.9932 17.7364 13.8820 44.9500 27.2022 1.5086 5.7085 206.6376 8.3077 4.1773 9.3955 11.0706 1.8955 6.4862 1.3452 7.8683 52.1991 7.1511 18.7836 6.7974 137.3074 100.4022 16.6116 18.1404 88.5091 75.9016 21.5247 58.2153 50.6782 28.0114 24.2382 27.4064 26.3581 25.9067 45.0447 33.3068 40.5993 28.5196 47.2519 42.3561 23.4068 29.5260 41.8781 52.8037 40.7192 41.5080 39.2232 25.6960 31.3782 34.0671 59.9795 35.6777 2.1393 20.6461 21.3299 26.6423 7.6135 16.5210 14.7911
temp: 298.150 k
press: 1.00000 atm
elementType: 8 8 7 6 6 6 6 6 6 6 6 6 6 6 6 6 6 6 6 6 6 6 6 6 6 6 1 1 1 1 1 1 1 1 1 1 1 1 1 1 1 1 1 1 1 1 1 1 1 1 1 1 1 1 1 1 1 1 1
symmnumber: 1
zpe: 1341115.1 jmol-1
zpe.correction: 0.510804 hartree
zpe.thermalcorrener: 0.536917 hartree
zpe.thermalcorrenthalpy: 0.537861 hartree
zpe.thermalcorrgfe: 0.454743 hartree
zpe.sumelectzpe: -1099.462528 hartree
zpe.sumelectthermal: -1099.436415 hartree
zpe.sumelectthermalent: -1099.435471 hartree
zpe.sumelectthermalfe: -1099.518589 hartree
dipole: -2.0998 1.0892 2.0408
dipole: 3.1241
quadrupole: -139.0644 -146.9190 -163.1016
quadrupole: -17.5006 -8.6653 -3.0958
quadrupole: 10.6306 2.7760 -13.4066 -17.5006 -8.6653 -3.0958
hfenergy: -1099.9733318 hartree
pointgroup: C01 [X(C23H33N1O2)]
dipole: -0.8066328 0.315716 0.8720271 debye
polarizability: 349.4947557|-9.0874244|241.6098522|-6.6521945|9.3138904|187.3187999 unknown
InChI: InChI=1S/C23H33NO2/c1-22(2,3)24-21(25)20-13-19-18-8-6-14-12-15(26-5)7-9-16(14)17(18)10-11-23(19,20)4/h7,9,12,17-20,24H,6,8,10-11,13H2,1-5H3
charge 0 multiplicity 1
59 atoms
O  -3.363949 -1.051153 -1.309644
O  6.922112 -0.9139 -0.086307
N  -4.828759 -0.041233 0.207462
C  -1.524609 0.965253 0.730016
C  -0.656867 1.808713 -0.296512
C  -2.726465 1.103352 -0.320511
C  0.855415 1.54406 -0.458596
C  -1.667083 1.405743 -1.423718
C  -1.000325 -0.492091 0.852652
C  1.21984 0.041046 -0.283481
C  0.536742 -0.549109 0.987036
C  -1.778154 1.591817 2.109889
C  1.709612 2.412095 0.502239
C  2.732668 -0.193351 -0.263958
C  -3.659853 -0.082776 -0.535114
C  3.208267 2.297891 0.157817
C  3.668713 0.853036 -0.012446
C  3.230983 -1.501636 -0.472698
C  5.04898 0.558222 0.039935
C  -5.888962 -1.098447 0.240355
C  4.608893 -1.803945 -0.430202
C  5.5248 -0.75629 -0.164309
C  -6.978399 -0.598395 1.219092
C  -6.488903 -1.283787 -1.178306
C  -5.283738 -2.432991 0.750119
C  7.4577 -2.25917 -0.29582
H  -0.80082 2.886126 -0.0696
H  -3.307727 2.014668 -0.074207
H  1.132686 1.844207 -1.494007
H  -1.388906 0.471182 -1.940609
H  -1.926717 2.170462 -2.173933
H  -1.293163 -1.078199 -0.03933
H  -1.48386 -0.981956 1.721469
H  0.801056 -0.519196 -1.147106
H  0.883726 -0.007638 1.889653
H  0.857534 -1.600328 1.116047
H  -2.575239 1.045979 2.652708
H  -0.868495 1.555982 2.739164
H  -2.084262 2.651898 2.023164
H  1.539457 2.099857 1.551492
H  1.39242 3.470851 0.428946
H  3.82524 2.799551 0.928005
H  3.397012 2.842633 -0.791573
H  -4.982806 0.784906 0.79021
H  2.519792 -2.311454 -0.681418
H  5.781156 1.349827 0.236136
H  4.947351 -2.830008 -0.602297
H  -7.416433 0.358106 0.875239
H  -7.79435 -1.338589 1.28366
H  -6.568175 -0.457289 2.237325
H  -5.701586 -1.592137 -1.885057
H  -6.938834 -0.340401 -1.537829
H  -7.274619 -2.061284 -1.157478
H  -4.867255 -2.309312 1.766673
H  -6.065711 -3.213596 0.784468
H  -4.478404 -2.766121 0.075447
H  7.214587 -2.638764 -1.30793
H  7.077573 -2.969694 0.464679
H  8.548017 -2.15482 -0.192006
