program: Gaussian 09
title: 000274504
version: EM64L-G09RevD.01
frameworkgroup: C1[X(C14H14O9)]
method: RPBEPBE
basis: SDD
operation: Freq
keyword: #pfreq=noraman
keyword: PBEPBE/SDD
title: #p freq=noraman PBEPBE/SDD
converged: YES YES NO NO
title: Mulliken charges:
elementType: O O O O O O O O O C C C C C C C C C C C C C C H H H H H H H H H H H H H H
charge: -0.225140 -0.224879 -0.309316 -0.159348 -0.155369 -0.147339 -0.187362 -0.142057 -0.146969 -0.081393 -0.142320 -0.538801 -0.533560 -0.528192 -0.541537 -0.521715 -0.505486 0.205516 0.204126 0.200927 0.255445 0.248794 0.251424 0.273001 0.275211 0.250794 0.300731 0.283390 0.247499 0.271343 0.273855 0.268533 0.266812 0.236753 0.266085 0.250260 0.260282
chargesum: 0.00000
title: Mulliken charges with hydrogens summed into heavy atoms:
elementType: O O O O O O O O O C C C C C C C C C C C C C C
charge: -0.225140 -0.224879 -0.309316 -0.159348 -0.155369 -0.147339 -0.187362 -0.142057 -0.146969 0.191608 0.132891 0.012723 -0.002671 0.017006 -0.006192 -0.018876 0.005057 0.205516 0.204126 0.200927 0.255445 0.248794 0.251424
polarizability: 1.99997523e+02 -1.34061747e+00 1.71490491e+02 1.55111421e+00 1.55537300e+01 1.45933198e+02
1716.lowfreq: -17.9628 -10.6859 -5.5363 -0.0004 0.0003 0.0005 5.7476 16.0238 25.7260
frequency: -7.0065 2.5244 25.5353 31.9184 35.5652 47.0560 62.8034 68.7310 90.3211 108.6499 112.0442 126.1610 148.3398 165.8251 176.4794 233.2899 259.0787 320.6917 331.7928 344.1468 370.8107 384.2952 396.2730 410.1646 432.1749 442.3356 464.1390 499.7289 511.9714 512.8392 527.0404 546.4171 567.5083 577.1397 588.4329 609.7337 644.0428 685.8207 711.9998 740.3013 764.8732 776.7140 832.8806 849.5239 855.9848 861.6698 869.1937 891.8536 894.5995 920.8577 928.4161 961.9417 984.7862 1002.9427 1029.7994 1034.0013 1050.2767 1067.1314 1094.0922 1104.5358 1134.0085 1157.7533 1162.9020 1170.5543 1181.7041 1198.8129 1212.2109 1231.2958 1256.5863 1265.9465 1282.9024 1295.9989 1311.1063 1314.0935 1326.7493 1343.4391 1347.1495 1355.4642 1365.3414 1430.0691 1435.2943 1444.8890 1447.0599 1449.8208 1458.7822 1659.0267 1680.0538 1683.9574 1720.4900 1722.0546 1724.5787 2982.2089 2983.4421 2994.5628 2995.5887 3015.3380 3023.6093 3029.1659 3039.9745 3074.5744 3074.8294 3080.9561 3090.1095 3090.2595 3094.9213
redmass: 6.7115 6.8601 9.6110 11.3141 9.1567 4.0460 7.6870 5.3593 6.8199 10.7133 7.9138 13.2826 4.1710 5.4410 5.9660 5.0569 3.1683 3.9422 4.8236 4.4314 5.1350 3.1312 3.2577 3.1525 3.1523 4.2108 8.0270 4.4313 3.2416 4.0028 4.7086 5.3540 3.8566 3.5151 5.4104 5.0487 5.9172 6.1433 4.4793 6.9998 5.2308 4.1050 3.4334 2.6249 6.6646 3.4284 4.1366 2.5768 2.8288 2.4285 2.7047 2.3108 3.1482 2.9893 4.1847 2.9491 3.3717 2.8238 2.1370 2.2446 2.8351 2.1309 3.7759 1.7982 1.2489 1.2394 1.3515 1.3888 1.2606 1.4940 1.3091 1.2926 1.4278 1.2935 1.5595 1.4051 1.4595 1.3616 1.4629 1.0773 1.0727 1.0816 1.0803 1.0964 1.0926 11.5974 12.3234 12.5036 12.1825 12.1546 11.4402 1.0672 1.0658 1.0653 1.0672 1.0606 1.0591 1.0794 1.0863 1.0959 1.0949 1.0958 1.0949 1.1038 1.1043
irintensity: 3.4620 2.9178 2.7842 0.3632 3.4231 1.5780 3.0681 0.6660 5.1296 2.8867 3.3493 1.0877 13.9423 2.1632 3.1017 1.2803 0.4988 7.1607 6.7379 0.4446 0.4292 4.2668 2.1750 5.3573 7.4725 14.0853 6.0157 1.4743 20.9462 1.6829 51.1839 31.8821 15.3528 9.8502 9.8364 3.5969 4.6706 13.0011 17.4283 19.1665 7.3786 12.6194 13.3399 76.3106 165.7052 58.7866 239.7443 110.2281 186.1185 25.9541 17.9458 142.4204 22.0038 495.4678 269.2953 156.6716 35.9483 211.9007 5.0390 6.2598 40.7360 61.8545 82.4205 54.4951 28.4250 62.3599 13.5142 11.8609 29.3743 3.0140 2.7660 13.2798 14.5039 3.9307 6.4707 22.1892 8.4758 2.7115 6.5563 5.0632 13.7396 12.7850 25.3254 31.3746 17.1994 78.0520 488.7203 347.8298 171.6127 182.4559 231.5441 8.4359 3.3538 6.5952 4.3612 2.8656 4.0935 14.8354 9.8871 4.4006 0.8088 2.7768 4.9110 18.7704 7.6124
temp: 298.150 k
press: 1.00000 atm
elementType: 8 8 8 8 8 8 8 8 8 6 6 6 6 6 6 6 6 6 6 6 6 6 6 1 1 1 1 1 1 1 1 1 1 1 1 1 1
symmnumber: 1
zpe: 702386.4 jmol-1
zpe.correction: 0.267525 hartree
zpe.thermalcorrener: 0.288800 hartree
zpe.thermalcorrenthalpy: 0.289744 hartree
zpe.thermalcorrgfe: 0.211904 hartree
zpe.sumelectzpe: -1217.212452 hartree
zpe.sumelectthermal: -1217.191177 hartree
zpe.sumelectthermalent: -1217.190233 hartree
zpe.sumelectthermalfe: -1217.268072 hartree
dipole: 5.0688 2.3869 -0.4282
dipole: 5.6190
quadrupole: -147.4590 -167.5272 -132.2442
quadrupole: -0.8542 34.5851 -9.6207
quadrupole: 1.6178 -18.4504 16.8326 -0.8542 34.5851 -9.6207
hfenergy: -1217.4799767 hartree
pointgroup: C01 [X(C14H14O9)]
dipole: 1.9548236 0.9712292 -0.3501151 debye
polarizability: 198.1989748|3.25353|161.1708148|-8.8156668|19.7613168|158.0514219 unknown
InChI: InChI=1S/C14H14O9/c15-9-1-7(2-10(16)21-9)5-13(19)23-14(20)6-8-3-11(17)22-12(18)4-8/h7-8H,1-6H2
charge 0 multiplicity 1
37 atoms
O  -3.770429 -1.31395 1.464826
O  2.569829 -1.376288 -1.745487
O  0.548858 1.843174 -0.499533
O  -4.051986 -2.78161 -0.270477
O  -3.62831 0.145737 3.225703
O  4.772482 -1.396986 -2.380564
O  0.359482 -1.439717 -1.149834
O  -0.931431 3.659535 -0.152447
O  1.491545 2.853731 1.422861
C  -2.199654 0.450237 -0.134799
C  3.170687 0.166585 0.587446
C  -3.010154 -0.641271 -0.861858
C  -3.040042 1.05136 1.013808
C  4.338898 -0.567466 -0.107024
C  1.949698 -0.784196 0.611715
C  -1.744991 1.538038 -1.150401
C  2.895297 1.531308 -0.127013
C  -3.641027 -1.667611 0.069401
C  -3.484326 -0.009043 2.008165
C  3.97502 -1.129951 -1.478231
C  1.518611 -1.212232 -0.780536
C  -0.747658 2.501404 -0.538379
C  1.6288 2.197828 0.382747
H  -1.29367 -0.029124 0.280555
H  3.453371 0.381683 1.633499
H  -3.833342 -0.188356 -1.452004
H  -2.372503 -1.199688 -1.568607
H  -2.496226 1.825463 1.58048
H  -3.948041 1.537074 0.599886
H  4.675006 -1.420261 0.516388
H  5.219652 0.082209 -0.248725
H  1.076262 -0.339632 1.114087
H  2.213399 -1.697312 1.182634
H  -2.614726 2.119913 -1.504038
H  -1.267252 1.036488 -2.010573
H  3.744321 2.206937 0.07657
H  2.809652 1.38799 -1.217635
