program: Gaussian 09
title: 000274467
version: EM64L-G09RevD.01
frameworkgroup: C1[X(C9H16O3)]
method: RPBEPBE
basis: SDD
operation: Freq
keyword: #pfreq=noraman
keyword: PBEPBE/SDD
title: #p freq=noraman PBEPBE/SDD
converged: YES YES NO NO
title: Mulliken charges:
elementType: O O O C C C C C C C C C H H H H H H H H H H H H H H H H
charge: -0.292125 -0.404271 -0.226154 0.336117 0.268803 -0.413432 -0.428117 -0.468642 -0.733982 -0.732222 -0.731062 0.117331 0.199117 0.203069 0.202543 0.226775 0.239027 0.218756 0.229462 0.199573 0.228948 0.240965 0.231586 0.214665 0.232437 0.210385 0.256992 0.373455
chargesum: 0.00000
title: Mulliken charges with hydrogens summed into heavy atoms:
elementType: O O O C C C C C C C C C
charge: -0.292125 -0.030816 -0.226154 0.336117 0.268803 -0.011246 0.001201 -0.010858 -0.075999 -0.045006 -0.031247 0.117331
polarizability: 1.10203668e+02 -1.86473671e+00 1.02090461e+02 -2.40924939e-02 -7.78893512e-01 9.80228683e+01
1716.lowfreq: -17.2743 -6.7655 0.0006 0.0007 0.0008 12.2478 58.7755 96.6364 115.0613
frequency: 58.7688 96.6123 115.0604 194.3726 202.3417 216.9473 225.8793 233.1773 263.0073 276.8177 298.6113 320.6137 351.0973 385.9735 417.9627 442.5017 448.9611 518.0063 535.7847 554.3130 603.1243 670.9536 716.1652 724.9769 786.1053 845.9627 855.1941 899.5587 920.6832 928.1437 940.6336 973.7991 987.2582 1019.1056 1048.3851 1064.9075 1079.0957 1090.1878 1157.2330 1185.4374 1206.4214 1215.6093 1240.5068 1243.7920 1282.4339 1303.6956 1338.1783 1342.1168 1346.4781 1372.3246 1378.8335 1388.7155 1443.5418 1447.9322 1457.1279 1461.0218 1464.5929 1473.3197 1474.1355 1483.4878 1492.3650 1629.9625 2975.9286 2986.4232 2990.5202 2994.5007 2997.7020 3000.7368 3035.7729 3054.6069 3069.2203 3078.9185 3088.8949 3095.1680 3095.9908 3100.4160 3119.3345 3501.8330
redmass: 10.8095 3.2378 4.2316 1.6465 1.0512 1.6337 1.9364 1.5479 1.8803 2.2333 2.6443 2.7156 3.0085 2.3411 3.1085 3.1813 2.8819 3.7334 4.0704 1.9634 1.3565 3.2965 3.2981 4.9343 2.6903 2.1336 1.9451 2.1555 1.7451 1.8005 2.5985 1.6472 1.3161 1.8788 1.8394 2.0567 1.9720 1.5867 2.2807 2.3572 2.1250 1.6988 2.1194 2.1908 1.6735 1.9202 1.3970 1.6014 1.5021 1.2516 1.2093 1.2105 1.0882 1.0689 1.0569 1.0682 1.0646 1.0585 1.0555 1.0749 1.0567 8.7384 1.0593 1.0353 1.0368 1.0499 1.0470 1.0627 1.1002 1.1002 1.1021 1.0980 1.0993 1.1003 1.0995 1.0999 1.1003 1.0639
irintensity: 1.0745 0.2274 1.1591 0.5414 0.5977 0.4670 0.5128 0.7234 0.9188 2.8222 1.9718 2.5770 2.6659 1.4333 0.9988 1.7577 0.5949 26.9127 3.0460 26.4674 98.1070 15.4560 20.2499 14.3480 6.4490 14.2424 4.9456 12.5700 4.5528 17.6794 57.9134 9.9542 1.9330 148.9474 63.6598 57.1839 2.1875 25.1890 13.3486 11.9393 11.1997 35.6585 3.9567 10.7970 21.5539 4.6040 2.8977 12.5921 2.6727 29.2559 17.5921 20.4592 7.7536 0.3418 6.4277 21.0325 1.5391 11.9306 3.4902 28.0878 8.0614 169.3260 29.8454 19.6501 25.9724 2.3842 43.8780 25.7495 27.5017 38.7004 22.9407 27.6983 32.6877 23.4559 27.4314 29.1073 13.0861 21.6198
temp: 298.150 k
press: 1.00000 atm
elementType: 8 8 8 6 6 6 6 6 6 6 6 6 1 1 1 1 1 1 1 1 1 1 1 1 1 1 1 1
symmnumber: 1
zpe: 624009.7 jmol-1
zpe.correction: 0.237673 hartree
zpe.thermalcorrener: 0.250662 hartree
zpe.thermalcorrenthalpy: 0.251607 hartree
zpe.thermalcorrgfe: 0.199851 hartree
zpe.sumelectzpe: -577.266294 hartree
zpe.sumelectthermal: -577.253305 hartree
zpe.sumelectthermalent: -577.252360 hartree
zpe.sumelectthermalfe: -577.304116 hartree
dipole: 0.7881 0.0755 -0.1606
dipole: 0.8078
quadrupole: -70.2494 -69.7285 -76.5580
quadrupole: 3.6579 -3.8859 5.4030
quadrupole: 1.9292 2.4502 -4.3794 3.6579 -3.8859 5.4030
hfenergy: -577.503967 hartree
pointgroup: C01 [X(C9H16O3)]
dipole: -0.3108585 -0.0312912 -0.0582467 debye
polarizability: 110.140591|-1.9832318|102.2768697|0.1861176|0.315879|97.8995372 unknown
InChI: InChI=1S/C9H16O3/c1-8(2)5-4-6-9(3,12-8)7(10)11/h10H,4-6H2,1-3H3
charge 0 multiplicity 1
28 atoms
O  -0.40468 0.535185 0.933379
O  1.871641 1.702533 -0.354015
O  2.102888 -0.29961 -1.487773
C  -1.564493 0.420927 -0.023405
C  0.812047 -0.260551 0.660347
C  -1.889364 -1.074443 -0.275959
C  0.467867 -1.741489 0.373525
C  -0.644232 -1.891392 -0.687023
C  -2.697439 1.111802 0.754993
C  -1.270518 1.188144 -1.33419
C  1.650224 -0.104675 1.947612
C  1.635337 0.333825 -0.512455
H  -2.672519 -1.142688 -1.055797
H  -2.313423 -1.501727 0.654733
H  0.12885 -2.189092 1.327986
H  1.38112 -2.272884 0.051945
H  -0.264316 -1.567002 -1.673532
H  -0.915769 -2.958582 -0.789356
H  -2.452404 2.173763 0.930773
H  -3.645025 1.055861 0.188835
H  -2.839377 0.62356 1.734537
H  -0.870032 2.18843 -1.097367
H  -0.5474 0.664802 -1.983472
H  -2.205882 1.310649 -1.910842
H  1.07224 -0.507037 2.796769
H  2.603252 -0.658239 1.868658
H  1.863346 0.959782 2.133809
H  2.41976 2.022448 -1.122015
