program: Gaussian 09
title: 000274465
version: EM64L-G09RevD.01
frameworkgroup: C1[X(C9H16O)]
method: RPBEPBE
basis: SDD
operation: Freq
keyword: #pfreq=noraman
keyword: PBEPBE/SDD
title: #p freq=noraman PBEPBE/SDD
converged: YES YES NO NO
title: Mulliken charges:
elementType: O C C C C C C C C C H H H H H H H H H H H H H H H H
charge: -0.472792 -0.077132 0.255504 -0.581908 -0.488604 0.424896 -0.417772 -0.743717 -0.743973 -0.837079 0.221650 0.206450 0.243469 0.243701 0.203020 0.232354 0.199574 0.211520 0.254640 0.253508 0.199027 0.211854 0.228678 0.220908 0.222895 0.329331
chargesum: 0.00000
title: Mulliken charges with hydrogens summed into heavy atoms:
elementType: O C C C C C C C C C
charge: -0.143460 0.144518 0.255504 -0.131989 -0.041883 0.424896 -0.185418 -0.077983 -0.079584 -0.164599
polarizability: 1.14393516e+02 -3.55422695e+00 1.01736525e+02 1.08110487e+00 3.01137980e-01 7.76073746e+01
1716.lowfreq: -8.5854 -0.0005 -0.0005 0.0004 4.9959 11.1935 72.8776 94.1762 160.6197
frequency: 72.8485 94.1088 160.6184 174.9417 217.2486 228.9346 256.1276 274.3527 287.4553 291.4401 320.8758 366.0736 371.4892 442.1002 476.5848 531.2013 553.7272 628.3799 758.3304 801.2323 837.0155 870.6964 905.4508 909.9427 913.7582 944.9886 969.6976 988.3569 1007.5970 1022.5267 1052.9615 1085.0448 1106.9588 1135.3950 1146.8816 1184.3094 1199.0077 1209.8786 1258.9594 1269.2934 1288.0758 1304.5665 1322.2387 1353.4019 1374.4898 1391.2804 1394.4522 1457.0770 1460.1980 1461.0540 1464.6495 1466.5016 1470.2574 1474.1197 1485.7841 1677.8805 2956.9422 2965.7844 2969.9250 2970.2817 2972.6405 2976.1309 3019.0503 3026.4267 3027.9503 3056.6207 3065.1184 3076.3265 3092.2821 3096.0613 3139.6981 3549.5370
redmass: 3.1944 2.6159 1.7846 1.3948 1.0486 2.2426 1.3503 2.3351 1.0913 2.1293 2.5812 2.2838 2.9535 2.0565 3.2312 2.8649 2.4806 3.6853 4.8451 1.2227 2.6974 4.0634 1.4216 1.6901 1.9921 1.7449 1.5602 1.3306 1.5436 1.4632 1.7008 3.7663 1.4073 1.2324 1.6553 2.2047 1.4924 2.8817 1.4221 1.4333 1.3820 1.5843 2.3745 2.1063 1.2254 1.2128 1.2748 1.0660 1.0532 1.0509 1.0727 1.0931 1.0608 1.0620 1.0701 6.4286 1.0388 1.0577 1.0596 1.0377 1.0678 1.0536 1.1012 1.0966 1.1005 1.0984 1.0973 1.0978 1.0988 1.0984 1.0957 1.0660
irintensity: 1.1224 0.9983 0.8128 0.4117 2.3262 0.9491 1.0337 10.3497 108.2473 12.4163 0.6929 0.9703 9.1824 5.9326 3.6270 7.2528 0.7468 1.2420 22.5544 28.7202 9.0099 0.9862 0.4278 2.0006 3.3441 1.9374 4.6564 0.2808 3.8000 17.1181 23.1395 2.1354 79.2255 2.5002 4.2355 1.7994 15.2015 18.8214 7.9726 7.1245 1.1428 20.9231 14.0452 14.7294 33.1536 20.6633 10.4226 7.7038 7.0373 8.3359 0.2711 2.2884 11.7309 3.4257 19.7613 4.2330 35.3355 64.5239 17.0602 20.2358 10.8075 43.9890 16.5686 19.9192 58.4778 1.5411 80.8146 29.8584 20.4403 32.0099 27.9479 4.8123
temp: 298.150 k
press: 1.00000 atm
elementType: 8 6 6 6 6 6 6 6 6 6 1 1 1 1 1 1 1 1 1 1 1 1 1 1 1 1
symmnumber: 1
zpe: 598931.9 jmol-1
zpe.correction: 0.228121 hartree
zpe.thermalcorrener: 0.239648 hartree
zpe.thermalcorrenthalpy: 0.240593 hartree
zpe.thermalcorrgfe: 0.192055 hartree
zpe.sumelectzpe: -426.954587 hartree
zpe.sumelectthermal: -426.943060 hartree
zpe.sumelectthermalent: -426.942115 hartree
zpe.sumelectthermalfe: -426.990653 hartree
dipole: -1.6713 -0.5901 -0.8118
dipole: 1.9494
quadrupole: -55.8726 -61.6552 -64.0362
quadrupole: 0.2042 -1.1100 -0.2939
quadrupole: 4.6488 -1.1339 -3.5149 0.2042 -1.1100 -0.2939
hfenergy: -427.182708 hartree
pointgroup: C01 [X(C9H16O1)]
dipole: 0.6605747 0.2163669 -0.3241314 debye
dipolederiv: -0.2414971 0.065662 0.022442 0.059702 -0.5737742 -0.003097 0.0081195 -0.0025073 -0.8150271 0.0677124 0.0262178 -0.0266329 0.0119801 -0.049844 0.0007233 0.0165843 0.0144832 0.1257632 0.3681202 -0.0204363 0.0065673 -0.0086762 0.4536012 0.0059686 0.0372441 0.007393 0.6108929 -0.197325 0.0265361 0.0439226 -0.0351995 0.0160958 -0.065157 0.0149421 -0.0741785 0.1690176 -0.1062055 -0.0522404 0.0163324 0.0031817 0.0179156 0.0801986 -0.0298485 0.0984405 0.1826579 0.2474433 -0.0483431 -0.0327012 0.0422444 0.2068606 0.0106537 -0.0303094 0.0645241 -0.1248973 0.0643575 0.0024407 -0.0169676 -0.0066939 -0.0814465 -0.0389507 0.0105386 -0.0959627 -0.2764427 -0.0129938 -0.0501207 0.0569525 -0.0556802 -0.178538 0.0826551 -0.0117329 0.0112183 -0.005849 -0.0696036 0.1020582 0.0748803 0.0957102 -0.1274189 -0.0480529 -0.0136562 -0.0010333 -0.001474 -0.0993422 0.0358696 0.0181438 0.0575941 0.0202003 -0.0036158 0.0231146 -0.0072263 0.1036245 0.0305094 0.0003521 0.0350576 0.0020519 0.0355326 0.0015598 0.0509301 -0.000163 -0.1701958 0.0514155 0.0025015 -0.0076978 0.0153378 -0.1074317 0.1086393 0.0090589 0.1522129 -0.0261599 0.0869076 -0.066419 -0.0178934 -0.0338043 -0.0095499 -0.0629154 -0.0179228 -0.0978455 -0.0499389 0.0166161 0.1032654 -0.0559122 0.0490368 0.0518982 0.0421861 -0.0609392 0.0768528 -0.0593719 0.0147288 0.0805423 0.0414697 0.0506857 -0.1007646 -0.097054 0.0705396 -0.1470801 -0.0091778 -0.1058993 -0.1170734 0.0260484 -0.1050926 -0.0083894 0.0214526 0.0315799 0.0305709 0.1699275 -0.1852033 -0.0829923 -0.0705946 -0.0279747 0.0648303 0.0165343 -0.1048755 -0.0153092 0.0471349 0.0994276 -0.0027375 -0.0082338 0.0010228 0.0795084 -0.0112251 0.0225182 0.0307774 -0.162831 0.0358761 0.1277161 0.0415985 0.1006247 -0.0474323 -0.0326274 0.0416073 -0.0538895 0.0658007 0.1012525 -0.0743103 0.0331901 -0.0439444 -0.1000129 0.0568774 0.0231368 0.0764952 0.0577636 -0.1909899 -0.0113208 -0.0616953 -0.0741118 0.0664267 -0.0420618 -0.1006908 -0.0230322 0.0505861 0.0968129 0.0069479 -0.0107211 0.0075418 0.0809613 -0.0097775 0.0330274 -0.0395389 -0.1601102 -0.1066382 -0.0614387 0.0213551 -0.1593638 -0.0184733 0.0178282 0.0214995 0.0105808 0.1036262 0.0382076 0.0536649 -0.0002061 0.0735419 -0.0081391 0.112227 -0.0736182 0.1408862 -0.0649191 0.0499374 0.0255425 -0.0260207 0.0525727 -0.0215884 -0.1221103 0.0474256 -0.1503589 -0.0521507 -0.0536269 -0.0718845 -0.1026837 -0.0722873 0.3389719 -0.0208591 -0.0182731 -0.0063098 0.2917504 unknown
polarizability: 114.2414631|-3.8092467|101.8719879|-1.2023027|-0.489977|77.6239646 unknown
InChI: InChI=1S/C9H16O/c1-7-4-5-8(6-7)9(2,3)10/h4,8,10H,5-6H2,1-3H3
charge 0 multiplicity 1
26 atoms
O  1.578653 0.173461 1.486221
C  0.270629 -0.135614 -0.51976
C  1.704567 0.142036 0.00023
C  -0.789385 0.941145 -0.12399
C  -0.349042 -1.491507 -0.041874
C  -2.092433 0.150393 -0.025329
C  -1.837757 -1.186499 0.015912
C  2.22806 1.511459 -0.492001
C  2.678054 -0.990006 -0.402612
C  -3.431759 0.835472 0.074673
H  0.330573 -0.163329 -1.627405
H  -0.85107 1.769801 -0.856322
H  -0.537211 1.386449 0.860544
H  0.035581 -1.7538 0.964796
H  -0.104551 -2.33069 -0.720681
H  -2.602552 -1.96291 0.133481
H  3.25441 1.696631 -0.118977
H  2.259442 1.552306 -1.59667
H  1.578235 2.325909 -0.130097
H  2.351757 -1.95133 0.028622
H  3.701761 -0.776703 -0.037486
H  2.729304 -1.09877 -1.501931
H  -4.257837 0.109648 0.173022
H  -3.629841 1.462661 -0.817497
H  -3.466715 1.514861 0.949901
H  2.47663 0.343924 1.870433
