program: Gaussian 09
title: 000026520
version: EM64L-G09RevD.01
frameworkgroup: C1[X(C15H16N2O3)]
method: RPBEPBE
basis: SDD
operation: Freq
keyword: #p
keyword: freq=noraman
keyword: PBEPBE/SDD
title: #p freq=noraman PBEPBE/SDD
converged: YES YES NO NO
title: Mulliken charges:
elementType: O O O N N C C C C C C C C C C C C C C C H H H H H H H H H H H H H H H H
charge: -0.229190 -0.213828 -0.229670 -0.179145 -0.373595 -0.005296 -0.382334 0.405983 0.171234 0.083467 -0.718551 0.202357 -0.376826 -0.386558 -0.430104 -0.236165 -0.238395 -0.240160 -0.023988 -0.550989 0.237524 0.235636 0.235472 0.231394 0.223921 0.364922 0.258892 0.279777 0.249295 0.242777 0.230733 0.230808 0.233433 0.249518 0.219150 0.228505
chargesum: 0.00000
title: Mulliken charges with hydrogens summed into heavy atoms:
elementType: O O O N N C C C C C C C C C C C C C C C
charge: -0.229190 -0.213828 -0.229670 -0.179145 -0.008674 -0.005296 0.090826 0.405983 0.171234 0.083467 -0.027764 0.202357 -0.117934 -0.106781 0.061968 -0.005432 -0.007587 -0.006727 0.225530 -0.103334
polarizability: 2.15826118e+02 6.75071761e+00 1.56582177e+02 7.76463449e-01 6.28631169e+00 1.62915185e+02
1716.lowfreq: -10.6467 -5.5291 -1.4578 -0.0008 -0.0005 -0.0004 20.5535 28.7802 40.9935
frequency: 19.8248 28.7743 40.9705 54.6864 80.8438 94.6095 108.3882 146.2031 163.7541 165.2716 183.7479 207.9981 217.9494 282.2670 286.1605 306.1075 328.1563 344.5700 368.9790 392.3286 402.1107 412.9078 437.6131 474.9037 514.3086 537.2916 592.3879 614.0093 642.6321 655.8453 672.8678 697.1827 703.2308 706.0090 724.9363 761.9490 766.7069 772.0880 851.4556 857.4309 895.5022 913.5194 931.3195 939.2034 958.9513 964.2821 985.7894 989.4848 998.6757 1002.6878 1010.5294 1031.8458 1064.6913 1082.6241 1092.7221 1123.0132 1146.5631 1150.8553 1165.7392 1177.1849 1197.0475 1209.2997 1279.1492 1282.9180 1296.9928 1314.5113 1331.0985 1332.1534 1348.9183 1368.2647 1376.5895 1381.4570 1391.9757 1427.3523 1434.9819 1444.5141 1447.5093 1481.9051 1483.2760 1486.4687 1581.2779 1589.2409 1605.6576 1639.7887 1655.2571 1661.2689 2988.2047 3024.4691 3038.4022 3074.6287 3082.7865 3092.6549 3099.3503 3107.8482 3125.5555 3127.9438 3136.4750 3148.5500 3156.6811 3168.3050 3203.1665 3517.4210
redmass: 3.9601 4.9200 4.3619 5.7776 3.0095 3.4571 2.3482 5.6604 8.0910 4.3468 4.9399 1.3344 4.9802 2.7782 2.7439 3.6260 3.6096 5.9100 7.2700 2.5955 2.8588 4.7197 4.4882 3.0442 3.8625 5.8959 4.3008 6.3226 3.1900 3.2522 2.9259 6.0380 3.1656 2.6170 3.4897 1.5093 1.7372 1.8087 3.2932 1.2631 1.5457 3.9006 1.7046 2.0012 2.0634 1.3360 1.4447 4.9510 2.0623 1.4241 1.1853 2.4873 2.7343 2.5951 1.6689 4.0978 2.6371 3.5586 2.7459 1.0697 2.9521 1.1336 1.7595 1.2470 1.4776 2.0043 1.4009 1.3858 1.7058 2.5939 5.8538 2.0158 1.2128 1.1751 2.2357 1.1242 1.0886 1.9300 1.0804 1.0436 10.7264 5.9374 5.7602 6.4309 8.0272 4.6693 1.0357 1.0604 1.0603 1.1009 1.0981 1.0603 1.1033 1.0995 1.0987 1.0849 1.0882 1.0926 1.0954 1.1013 1.1150 1.0768
irintensity: 0.0726 0.6220 0.4081 0.0761 0.0408 1.1885 0.3102 0.3632 11.5692 2.0914 1.1074 0.5378 0.6875 2.8626 1.6775 1.9605 1.0703 26.3193 7.8112 3.8468 0.0101 1.9932 15.5040 2.8465 12.6569 24.9824 9.4271 0.7461 12.5370 19.9990 14.0296 2.6446 10.7631 40.7903 12.2027 8.0152 37.1237 107.3265 3.3589 0.7805 12.2593 15.1212 11.7525 0.6076 10.3981 75.4189 0.3481 3.2233 6.4900 1.3388 16.7747 16.0478 20.7539 9.7714 7.7329 20.5558 5.5486 5.1698 15.3202 0.1755 25.1551 7.7287 85.6401 1.8698 52.6980 199.2535 31.9789 16.7744 95.8130 172.3501 2.3988 18.2299 16.8997 10.8680 14.3585 40.6864 39.4368 36.5683 7.1745 18.0918 257.3870 9.5316 12.5122 334.4383 215.5059 0.7745 27.3625 13.2774 11.7158 2.8896 35.3854 5.6255 20.1010 1.7007 4.1990 0.1299 7.7443 7.5509 15.3926 24.5253 18.9647 64.2006
temp: 298.150 k
press: 1.00000 atm
elementType: 8 8 8 7 7 6 6 6 6 6 6 6 6 6 6 6 6 6 6 6 1 1 1 1 1 1 1 1 1 1 1 1 1 1 1 1
symmnumber: 1
zpe: 743993.2 jmol-1
zpe.correction: 0.283372 hartree
zpe.thermalcorrener: 0.302121 hartree
zpe.thermalcorrenthalpy: 0.303066 hartree
zpe.thermalcorrgfe: 0.234885 hartree
zpe.sumelectzpe: -914.942526 hartree
zpe.sumelectthermal: -914.923776 hartree
zpe.sumelectthermalent: -914.922832 hartree
zpe.sumelectthermalfe: -914.991013 hartree
dipole: -0.6372 -1.1716 -0.3870
dipole: 1.3887
quadrupole: -109.7263 -118.9057 -121.1889
quadrupole: 7.7476 -3.9083 0.0913
quadrupole: 6.8807 -2.2987 -4.5819 7.7476 -3.9083 0.0913
hfenergy: -915.2258976 hartree
pointgroup: C01 [X(C15H16N2O3)]
dipole: -0.2370758 -0.4558121 -0.1858315 debye
polarizability: 215.4600894|7.4078484|156.1391784|2.9226603|6.1922265|163.7242127 unknown
InChI: InChI=1S/C15H16N2O3/c1-3-10-17-13(19)15(4-2,12(18)16-14(17)20)11-8-6-5-7-9-11/h3,5-9,16H,1,4,10H2,2H3
charge 0 multiplicity 1
36 atoms
O  0.922776 -0.219514 -2.018962
O  -0.922325 2.55299 1.409677
O  2.313593 -0.602205 2.41494
N  1.560331 -0.5036 0.189566
N  0.656506 0.932619 1.861241
C  -0.513421 0.858155 -0.339109
C  -0.879715 1.931395 -1.415609
C  -1.708535 -0.147427 -0.196649
C  0.71436 0.040148 -0.803056
C  -0.282711 1.542969 1.017403
C  0.219446 2.983557 -1.667132
C  1.553213 -0.107501 1.545758
C  -2.637067 -0.053017 0.87098
C  -1.917746 -1.126911 -1.202917
C  2.623942 -1.47114 -0.235996
C  -3.741344 -0.932435 0.938308
C  -3.023144 -2.001687 -1.131976
C  -3.939038 -1.912039 -0.059236
C  3.87972 -0.76391 -0.7094
C  5.072524 -0.847709 -0.071865
H  -1.806107 2.425746 -1.073939
H  -1.106973 1.391598 -2.351125
H  0.440704 3.565365 -0.754738
H  1.151347 2.515939 -2.032026
H  -0.116502 3.697605 -2.440145
H  0.736462 1.300578 2.815077
H  -2.522145 0.71355 1.643627
H  -1.220947 -1.205337 -2.044257
H  2.186888 -2.071028 -1.052472
H  2.83737 -2.115155 0.631214
H  -4.448353 -0.845117 1.770714
H  -3.168197 -2.751425 -1.917681
H  -4.795601 -2.592692 -0.004043
H  3.77634 -0.17667 -1.631914
H  5.963179 -0.337382 -0.455401
H  5.18867 -1.423614 0.854244
