program: Gaussian 09
title: 000274534
version: EM64L-G09RevD.01
frameworkgroup: C1[X(C22H28N4O4S2)]
method: RPBEPBE
basis: SDD
operation: Freq
keyword: #p
keyword: freq=noraman
keyword: PBEPBE/SDD
title: #p freq=noraman PBEPBE/SDD
converged: YES YES NO NO
title: Mulliken charges:
elementType: S S O O O O N N N N C C C C C C C C C C C C C C C C C C C C C C H H H H H H H H H H H H H H H H H H H H H H H H H H H H
charge: 0.959221 0.959473 -0.540857 -0.512013 -0.512097 -0.540501 0.064184 0.064091 -0.505456 -0.505579 0.134967 0.060313 -0.017186 -0.016836 -0.707244 -0.695738 -0.698708 -0.679021 -0.034325 -0.034451 -0.229505 -0.244785 -0.244700 -0.229276 -0.393535 -0.332640 -0.332505 -0.393717 0.453473 0.453487 -0.799075 -0.799105 0.230320 0.215559 0.230313 0.233428 0.217059 0.233694 0.217065 0.217113 0.242613 0.231353 0.227613 0.227678 0.301428 0.301347 0.287011 0.281835 0.281835 0.287030 0.244517 0.243204 0.243220 0.244483 0.235055 0.229193 0.240741 0.240780 0.229189 0.234968
chargesum: 0.00000
title: Mulliken charges with hydrogens summed into heavy atoms:
elementType: S S O O O O N N N N C C C C C C C C C C C C C C C C C C C C C C
charge: 0.959221 0.959473 -0.540857 -0.512013 -0.512097 -0.540501 0.064184 0.064091 -0.204028 -0.204233 0.134967 0.060313 -0.017186 -0.016836 -0.031051 -0.011558 -0.021917 0.007623 -0.034325 -0.034451 0.057506 0.037050 0.037135 0.057754 -0.149017 -0.089437 -0.089284 -0.149234 0.453473 0.453487 -0.094086 -0.094167
polarizability: 4.60666371e+02 3.61242816e-01 3.45419093e+02 -1.65626235e-01 1.33491071e+01 2.90808695e+02
1716.lowfreq: -0.0007 0.0009 0.0016 1.6333 1.8819 6.5997 9.4967 12.2603 16.1021
frequency: 8.0646 11.8363 15.9525 18.8844 27.1304 33.1297 35.8585 37.4474 38.7115 40.6767 63.4152 71.5762 76.2069 94.8858 110.0361 119.3475 119.5860 128.9480 130.5189 144.6214 159.1139 160.5147 171.0401 175.7796 199.3225 201.8978 202.9948 217.8225 224.0937 227.1592 228.6647 254.7567 272.6743 279.1014 280.6779 290.3400 290.8712 317.6767 322.7160 344.7921 354.7002 380.7853 385.3757 390.9212 394.4070 407.7272 407.7796 411.9999 418.5613 429.1571 465.7932 466.9357 510.5818 512.7898 551.9283 584.3991 584.9112 602.7586 605.0667 621.8397 621.9228 642.6361 686.5480 691.9031 708.6909 708.7619 771.9686 777.6080 778.4177 797.1287 813.4018 820.3132 829.3940 830.5478 849.3239 849.3669 855.4589 936.1127 943.0151 945.8568 950.5847 960.9883 961.5077 964.8036 967.7117 983.4642 983.6808 983.8998 988.3183 988.5830 997.8592 998.8879 1003.4534 1013.3392 1016.8550 1050.4781 1050.5741 1055.8717 1056.1031 1065.1320 1107.4864 1119.5261 1119.6058 1158.5343 1180.0888 1184.8903 1185.1494 1202.2052 1218.6947 1218.8504 1235.9837 1262.9056 1290.9092 1295.9902 1297.9896 1298.0399 1367.9461 1379.8784 1381.9860 1381.9992 1388.4170 1392.9485 1392.9784 1396.8733 1402.4188 1402.4510 1453.5744 1457.1992 1458.5732 1462.1085 1470.8195 1470.8818 1471.5188 1474.1675 1474.2362 1476.1587 1476.2594 1476.3150 1477.0971 1481.3552 1595.3150 1595.3537 1597.5909 1597.6617 1623.4945 1688.8911 2970.8405 2982.4362 2982.5992 2982.6450 2984.0892 2985.7563 3054.1964 3062.1173 3062.1679 3079.3920 3084.6310 3087.1196 3089.2322 3089.3237 3091.1717 3092.8353 3092.8709 3094.1276 3135.4878 3135.5403 3140.4805 3140.7914 3164.4270 3164.5183 3170.1793 3170.3465 3243.5287 3245.1132
redmass: 5.2261 5.8882 4.5745 5.6394 4.2308 3.9279 1.8689 1.2078 1.2999 5.1040 5.4347 5.5350 4.0974 4.4771 3.1123 4.5097 4.8327 6.2160 5.0665 1.3693 9.7119 2.3939 1.6712 1.2502 2.1271 5.2932 1.5303 1.6135 5.2161 3.8623 6.3000 4.5797 5.2667 3.5391 2.5050 3.7080 5.1203 4.4677 3.4686 3.1155 3.1906 3.7396 4.3589 6.2231 9.8353 2.9079 2.8758 5.7894 6.0264 4.1591 4.1355 4.0233 3.1123 3.2028 3.7787 5.1856 5.0451 6.1132 5.1399 6.9498 6.9459 2.2884 5.7641 2.9452 3.2631 3.2584 2.7597 4.9271 4.8769 3.0551 9.4080 3.2079 1.3959 1.5225 1.2467 1.2509 2.7144 1.4535 1.4313 10.1053 11.1320 1.8788 2.0194 1.3295 1.9163 1.2988 1.3971 1.3867 1.9588 1.8734 2.6157 2.7946 1.3632 3.4107 2.9757 1.5847 1.5842 2.4879 2.4854 2.2254 4.0538 1.2855 1.2859 2.3609 4.8016 1.1444 1.1443 2.7929 2.9956 2.9943 3.4975 2.4536 1.2359 1.5346 1.2617 1.2614 1.1794 1.1742 4.7799 4.7891 1.2035 2.9821 2.9748 1.1922 1.3070 1.3052 1.0512 1.0476 1.0500 1.0471 1.0485 1.0476 1.0640 2.3496 2.3486 1.1138 1.0527 1.1139 1.0590 1.0594 6.6034 6.5899 6.3392 6.3296 11.2671 11.9870 1.0362 1.0347 1.0378 1.0377 1.0338 1.0342 1.0983 1.0971 1.0972 1.1000 1.1007 1.1001 1.1012 1.1001 1.1000 1.0991 1.0991 1.1005 1.0894 1.0894 1.0898 1.0898 1.0957 1.0958 1.0962 1.0962 1.0743 1.0743
irintensity: 0.0388 0.1763 0.0057 2.8748 1.2467 0.0770 1.6365 0.3020 0.1495 1.3416 0.1633 0.1812 0.0007 0.9422 6.1540 0.1309 1.3210 0.3655 0.0047 0.4613 3.0126 6.7198 0.5113 0.0492 0.2284 0.3790 0.7050 11.4682 8.6837 15.6255 11.4241 22.5690 0.8614 26.1657 0.0237 9.5647 3.1107 3.9548 4.4812 1.7743 17.0431 26.3471 4.4718 25.8951 3.2453 3.2600 2.5718 64.5767 175.3587 2.9942 31.6926 18.2784 119.5439 22.6984 10.5598 16.9714 12.4034 0.3039 16.7247 0.0696 0.1473 94.6281 3.1295 100.1475 0.1924 5.0956 23.0828 2.5660 4.3267 292.6768 140.7509 0.0473 11.7792 79.3873 0.2037 0.3529 49.6288 0.5613 1.2049 3.5944 119.7043 1.4765 0.0385 1.4750 2.7143 0.5198 1.3155 0.1472 2.8119 0.6865 7.6252 5.6367 0.0400 13.7649 34.7794 24.3306 9.4447 24.4357 31.8315 18.6759 1.6137 6.1369 9.9667 17.8368 10.0675 21.3703 10.5798 61.2993 6.4126 6.9847 0.6016 1.5669 23.0985 10.3895 2.2689 2.8624 9.0240 24.7304 2.5226 3.9750 8.6091 6.0638 13.5661 19.6536 10.7884 19.4217 2.4426 0.1919 14.1215 0.0037 15.5235 12.0131 25.0538 15.7031 31.4238 15.4050 2.9579 16.3928 10.3060 17.3455 5.5936 8.2161 4.8798 8.0144 77.8914 3.4748 21.1631 16.7599 20.4608 29.2953 22.8373 13.5899 55.5641 16.9984 14.2050 42.8247 4.5024 30.6015 4.2232 41.7447 3.8311 12.8894 19.7432 53.7291 11.0800 13.6246 9.4788 10.1818 2.8429 2.9277 6.7112 6.9978 11.0083 9.7636
temp: 298.150 k
press: 1.00000 atm
elementType: 16 16 8 8 8 8 7 7 7 7 6 6 6 6 6 6 6 6 6 6 6 6 6 6 6 6 6 6 6 6 6 6 1 1 1 1 1 1 1 1 1 1 1 1 1 1 1 1 1 1 1 1 1 1 1 1 1 1 1 1
symmnumber: 1
zpe: 1206188.8 jmol-1
zpe.correction: 0.459413 hartree
zpe.thermalcorrener: 0.496328 hartree
zpe.thermalcorrenthalpy: 0.497272 hartree
zpe.thermalcorrgfe: 0.383531 hartree
zpe.sumelectzpe: -2168.348772 hartree
zpe.sumelectthermal: -2168.311857 hartree
zpe.sumelectthermalent: -2168.310913 hartree
zpe.sumelectthermalfe: -2168.424653 hartree
dipole: 0.0673 9.7849 -2.6401
dipole: 10.1351
quadrupole: -209.5579 -197.7688 -201.5561
quadrupole: -0.1126 -0.4328 5.7727
quadrupole: -6.5970 5.1921 1.4049 -0.1126 -0.4328 5.7727
hfenergy: -2168.8081847 hartree
pointgroup: C01 [X(C22H28N4O4S2)]
dipole: 0.0604616 -3.8152609 -1.1575023 debye
polarizability: 460.659996|0.2714429|318.1057089|0.9236751|30.3959236|318.1284543 unknown
InChI: InChI=1S/C22H28N4O4S2/c1-15-7-11-17(12-8-15)31(27,28)25-23-19-21(3,4)20(22(19,5)6)24-26-32(29,30)18-13-9-16(2)10-14-18/h7-14,25-26H,1-6H3
charge 0 multiplicity 1
60 atoms
S  4.932856 1.535299 1.007497
S  -4.984812 1.462333 0.946054
O  5.528166 1.734331 2.510182
O  4.937336 2.7323 -0.092663
O  -4.996203 2.670935 -0.141444
O  -5.611817 1.632515 2.439179
N  2.324964 0.984629 0.271814
N  -2.359401 0.95687 0.245075
N  3.123383 0.931658 1.401825
N  -3.170608 0.891838 1.365313
C  -0.011662 1.00462 -0.776201
C  -0.024753 1.037917 1.510634
C  1.028133 1.026231 0.363195
C  -1.064412 1.015159 0.351516
C  -0.000815 -0.273707 -1.647063
C  -0.013058 2.277285 -1.65958
C  -0.035978 2.31746 2.389376
C  -0.023117 -0.244869 2.383381
C  5.668373 0.004498 0.218315
C  -5.670856 -0.075837 0.127132
C  5.686456 -0.070525 -1.181898
C  -6.191058 -1.089787 0.948185
C  6.19522 -0.988905 1.060045
C  -5.66015 -0.136281 -1.27386
C  6.26636 -1.219298 -1.766479
C  -6.727751 -2.229897 0.314883
C  6.7697 -2.122922 0.449416
C  -6.202432 -1.291496 -1.881389
C  6.811337 -2.256461 -0.965932
C  -6.739049 -2.349169 -1.102309
C  7.444388 -3.480933 -1.600902
C  -7.331938 -3.580594 -1.762108
H  0.901232 -0.284128 -2.284361
H  0.000928 -1.188912 -1.029024
H  -0.89682 -0.293296 -2.292617
H  -0.909336 2.283371 -2.304957
H  -0.021446 3.198473 -1.050795
H  0.890732 2.292781 -2.29422
H  -0.926969 2.337397 3.045536
H  0.84632 2.345136 3.056906
H  -0.036095 3.236306 1.77822
H  -0.015042 -1.156698 1.761654
H  0.870114 -0.266506 3.034135
H  -0.923212 -0.275694 3.024217
H  2.847214 1.509095 2.228127
H  -2.913985 1.473467 2.19481
H  5.276547 0.74424 -1.786466
H  -6.190243 -0.979461 2.037175
H  6.170995 -0.86735 2.147569
H  -5.256944 0.693837 -1.861806
H  6.294972 -1.30788 -2.858204
H  -7.145391 -3.037019 0.927927
H  7.193439 -2.913997 1.078966
H  -6.207989 -1.369042 -2.974317
H  7.010085 -4.413078 -1.19539
H  7.306479 -3.489631 -2.695063
H  8.531596 -3.514862 -1.398802
H  -8.422404 -3.639089 -1.584531
H  -7.169931 -3.576116 -2.852989
H  -6.887148 -4.507239 -1.355391
