program: Gaussian 09
title: 000274466
version: EM64L-G09RevD.01
frameworkgroup: C1[X(C9H16O3)]
method: RPBEPBE
basis: SDD
operation: Freq
keyword: #pfreq=noraman
keyword: PBEPBE/SDD
title: #p freq=noraman PBEPBE/SDD
converged: YES YES NO NO
title: Mulliken charges:
elementType: O O O C C C C C C C C C H H H H H H H H H H H H H H H H
charge: -0.286633 -0.299338 -0.464837 0.350205 0.277952 -0.482976 -0.501485 -0.428724 -0.431094 -0.764470 -0.309927 -0.340561 0.215965 0.235546 0.248332 0.214547 0.219758 0.212346 0.229735 0.194285 0.216026 0.232215 0.251273 0.223318 0.206018 0.233734 0.207057 0.341734
chargesum: 0.00000
title: Mulliken charges with hydrogens summed into heavy atoms:
elementType: O O O C C C C C C C C C
charge: -0.286633 -0.299338 -0.123103 0.350205 0.277952 -0.031466 -0.038607 0.003380 -0.007074 -0.064955 0.119409 0.100229
polarizability: 1.12187709e+02 3.63523175e+00 1.03122017e+02 8.84422277e-01 1.15337464e+00 8.91819905e+01
1716.lowfreq: -12.6142 -0.0011 -0.0007 -0.0005 9.4107 12.7338 49.0542 84.0177 94.7541
frequency: 49.0296 83.8534 94.7065 127.1192 169.1621 197.2779 212.3768 221.4764 251.3245 290.0133 310.5135 330.7084 360.5958 414.0923 449.9965 535.0281 612.9824 617.0464 675.9915 706.4219 744.2350 800.8272 854.6100 862.6728 900.9117 915.1838 925.8583 946.3189 958.7540 969.7221 982.1785 983.8113 1009.7617 1042.2713 1056.1895 1098.3792 1101.8880 1123.8922 1154.5278 1161.7996 1169.4830 1184.4649 1201.8011 1215.6514 1238.2935 1249.6057 1268.1359 1301.1365 1306.8858 1316.6813 1320.2528 1327.2879 1374.4559 1397.8114 1457.2574 1464.5920 1466.2278 1471.6434 1478.0702 1481.2522 1482.4785 1488.6598 2938.2795 2976.7141 2987.5745 2990.8255 3005.4914 3010.9564 3024.6273 3028.3332 3058.7649 3079.2130 3081.0198 3082.9009 3092.2218 3099.9674 3103.9959 3577.9257
redmass: 3.2675 2.8635 3.0700 2.0542 3.1863 2.6901 1.0637 1.1316 2.5360 3.9206 2.7005 2.9185 2.9689 3.5469 3.4913 3.8956 2.5439 2.9756 5.1336 3.1818 1.8206 1.9333 2.1299 2.2145 2.3518 3.2212 2.8499 1.9468 1.6656 4.2604 1.9445 3.5454 2.6691 2.9569 1.9478 2.0175 1.6334 3.1563 1.5039 1.1693 1.2462 1.3996 1.3301 1.4950 1.4652 1.4523 1.5599 1.9008 1.4748 1.5590 1.3149 1.2485 1.2418 1.3836 1.0751 1.0759 1.0891 1.0664 1.0914 1.0726 1.0701 1.0836 1.0619 1.0687 1.0622 1.0353 1.0595 1.0639 1.0636 1.0989 1.1013 1.1007 1.1023 1.0994 1.1033 1.1005 1.0999 1.0666
irintensity: 5.4285 0.2488 3.7162 2.9187 5.8143 16.5194 6.9373 126.1434 2.2339 0.6350 4.3560 2.6174 1.3157 6.3625 9.5904 4.9841 5.7899 12.0946 1.2550 11.6927 3.5369 26.1288 5.2008 2.0804 6.1349 34.1759 21.5954 9.4153 58.1342 46.8918 16.9007 16.7048 41.7388 8.4908 17.1692 14.5839 7.8558 121.8483 4.7987 1.8006 28.8716 8.6862 3.0901 4.8290 7.8351 2.8067 2.6529 24.3700 5.4571 1.9795 0.9572 1.7587 22.4248 6.4104 8.4624 4.5467 5.1063 3.6215 3.6045 13.6641 15.2270 8.4301 60.3166 59.0840 78.6781 23.7146 23.5612 41.0708 28.4610 35.2225 10.6664 36.5337 7.9674 34.0664 58.4065 28.6969 13.2840 2.0653
temp: 298.150 k
press: 1.00000 atm
elementType: 8 8 8 6 6 6 6 6 6 6 6 6 1 1 1 1 1 1 1 1 1 1 1 1 1 1 1 1
symmnumber: 1
zpe: 628664.2 jmol-1
zpe.correction: 0.239446 hartree
zpe.thermalcorrener: 0.252002 hartree
zpe.thermalcorrenthalpy: 0.252946 hartree
zpe.thermalcorrgfe: 0.201115 hartree
zpe.sumelectzpe: -577.220028 hartree
zpe.sumelectthermal: -577.207472 hartree
zpe.sumelectthermalent: -577.206528 hartree
zpe.sumelectthermalfe: -577.258358 hartree
dipole: -2.3994 -1.2142 -1.0457
dipole: 2.8853
quadrupole: -68.7183 -64.5041 -76.8471
quadrupole: 0.7299 0.2177 3.0103
quadrupole: 1.3049 5.5190 -6.8240 0.7299 0.2177 3.0103
hfenergy: -577.4594737 hartree
pointgroup: C01 [X(C9H16O3)]
dipole: -0.9561622 0.4478202 0.4169323 debye
polarizability: 112.2914184|-3.5245231|102.9078532|-0.6708206|1.7378894|89.2924453 unknown
InChI: InChI=1S/C9H16O3/c1-8(7-10)3-2-4-9(8)11-5-6-12-9/h10H,2-7H2,1H3
charge 0 multiplicity 1
28 atoms
O  -1.329336 0.421793 -1.2066
O  -1.144049 0.143333 1.135298
O  2.672876 1.73875 0.512948
C  0.983275 0.125269 -0.138771
C  -0.528278 -0.261737 -0.156882
C  1.578601 -1.045862 0.696126
C  -0.563199 -1.797513 -0.338233
C  0.784472 -2.318308 0.253361
C  1.214695 1.501915 0.506542
C  1.542627 0.118964 -1.584853
C  -2.42318 1.167169 -0.544813
C  -2.548235 0.46984 0.821935
H  1.411463 -0.84862 1.771513
H  2.665504 -1.14006 0.537779
H  -0.655392 -2.026269 -1.413855
H  -1.447093 -2.221425 0.169847
H  1.346819 -2.885846 -0.509582
H  0.622401 -2.997255 1.108243
H  0.811581 1.503673 1.53693
H  0.697406 2.286222 -0.089221
H  1.49102 -0.886156 -2.04047
H  0.971076 0.812192 -2.226408
H  2.597351 0.439434 -1.56075
H  -3.322488 1.076948 -1.17635
H  -2.142455 2.232635 -0.432513
H  -2.92359 1.114318 1.631676
H  -3.16011 -0.452362 0.751436
H  2.857936 2.594457 0.973168
