program: Gaussian 09
title: 000274463
version: EM64L-G09RevD.01
frameworkgroup: C1[X(C9H16ClN3O)]
method: RPBEPBE
basis: SDD
operation: Freq
keyword: #p
keyword: freq=noraman
keyword: PBEPBE/SDD
title: #p freq=noraman PBEPBE/SDD
converged: YES YES NO NO
title: Mulliken charges:
elementType: Cl O N N N C C C C C C C C C H H H H H H H H H H H H H H H H
charge: -0.077481 -0.302690 -0.310706 -0.364488 -0.614463 -0.139396 -0.096509 -0.055920 -0.449930 -0.528261 -0.494073 -0.459325 -0.457641 0.246013 0.262684 0.258437 0.208923 0.293674 0.215338 0.236453 0.257413 0.208047 0.205856 0.256015 0.233737 0.212282 0.277231 0.306776 0.332783 0.339218
chargesum: 0.00000
title: Mulliken charges with hydrogens summed into heavy atoms:
elementType: Cl O N N N C C C C C C C C C
charge: -0.077481 -0.302690 -0.033475 -0.057713 0.057538 0.123288 0.161928 0.153003 -0.156255 -0.076470 -0.028612 0.002547 -0.011622 0.246013
polarizability: 1.48481876e+02 -1.38509406e+00 1.26781974e+02 -9.19338958e+00 4.20760454e+00 9.89103212e+01
1716.lowfreq: -9.6266 -7.1076 0.0004 0.0021 0.0022 5.0273 27.6192 32.9028 63.2286
frequency: 27.3458 32.8362 63.2220 78.7325 131.0296 162.5370 189.7039 217.9742 243.8850 288.8908 314.1937 326.6100 381.8861 419.2946 465.6231 475.0856 512.5267 528.7616 577.8789 595.5778 615.0213 703.6547 734.0178 741.0638 763.2196 777.5410 804.2537 823.5455 859.8559 876.0086 905.2429 922.6070 932.5968 945.0420 972.7122 1012.0400 1031.4419 1035.8357 1042.8596 1056.8354 1067.2671 1101.3619 1137.7739 1142.3823 1160.8755 1164.9134 1175.7680 1203.6756 1212.9668 1243.6482 1252.4307 1256.3022 1269.9284 1277.7442 1297.1258 1307.7572 1316.2979 1334.3779 1355.9197 1388.8064 1395.8486 1464.5243 1470.2821 1480.4813 1484.3878 1485.1185 1547.7105 1673.5721 2893.7946 2975.4662 2995.9602 3009.3343 3022.6003 3030.3848 3066.0057 3068.3178 3083.2067 3087.6436 3091.6263 3102.2187 3394.0832 3462.1147 3525.8063 3705.7123
redmass: 7.7817 4.1965 5.7992 4.7699 4.6948 3.3449 2.9493 3.6244 3.9489 2.8298 3.5500 2.7084 3.5994 2.6066 1.7535 1.9929 2.2740 1.1851 2.6022 1.9829 1.6342 6.4130 2.6179 3.8864 1.6726 4.9988 2.6839 1.8739 2.0385 2.0226 2.1097 4.4841 2.0818 3.1333 1.6907 1.7889 1.9804 1.9699 1.8098 1.7046 2.2402 1.6072 1.3400 2.0063 1.6292 2.4484 1.3916 1.2394 1.4738 1.3516 1.2309 1.4512 1.3478 1.4432 1.4484 1.3736 1.5418 1.3843 1.4318 2.3298 1.3882 1.0840 1.0896 1.2747 1.0980 1.1834 1.3061 5.1880 1.0705 1.0841 1.0631 1.0599 1.0628 1.0905 1.1023 1.1028 1.0890 1.0888 1.1020 1.0936 1.0756 1.0767 1.0460 1.1027
irintensity: 1.4880 1.4801 2.4992 0.8769 1.3979 1.6793 3.3197 1.4273 0.6479 9.0443 14.8828 1.8401 9.9693 0.8466 32.2243 14.4612 55.2004 343.4382 4.4577 3.6554 10.7721 29.2574 10.2824 7.9224 87.8815 29.6118 0.8076 5.4127 0.7522 12.3620 6.8549 4.0477 3.3458 6.7595 2.0475 3.4317 1.1575 3.0462 0.6650 0.8917 5.5656 4.5309 8.2639 6.7248 0.6197 6.0006 1.2045 8.0045 1.7734 5.8004 3.2177 3.3099 0.8951 3.6095 4.6149 3.1136 10.5925 13.3651 1.5761 160.7441 41.2423 3.1365 9.2006 19.4648 2.3090 31.2826 201.8620 393.8240 69.7612 22.4781 42.7799 27.5686 49.4100 29.3576 22.1268 7.6787 23.1832 37.5316 44.7457 13.5649 2.6554 9.0554 31.0205 78.3609
temp: 298.150 k
press: 1.00000 atm
elementType: 17 8 7 7 7 6 6 6 6 6 6 6 6 6 1 1 1 1 1 1 1 1 1 1 1 1 1 1 1 1
symmnumber: 1
zpe: 662566.8 jmol-1
zpe.correction: 0.252358 hartree
zpe.thermalcorrener: 0.266179 hartree
zpe.thermalcorrenthalpy: 0.267123 hartree
zpe.thermalcorrgfe: 0.210068 hartree
zpe.sumelectzpe: -1050.985645 hartree
zpe.sumelectthermal: -1050.971825 hartree
zpe.sumelectthermalent: -1050.970880 hartree
zpe.sumelectthermalfe: -1051.027936 hartree
dipole: -3.8367 -3.7294 1.3520
dipole: 5.5188
quadrupole: -127.5528 -85.3795 -89.5564
quadrupole: 1.7624 5.8677 2.4169
quadrupole: -26.7233 15.4501 11.2732 1.7624 5.8677 2.4169
hfenergy: -1051.2380032 hartree
pointgroup: C01 [X(C9H16Cl1N3O1)]
dipole: 1.7032162 1.1351101 0.7245128 debye
polarizability: 145.0830182|-5.0256069|128.3483276|12.6703648|-5.8731499|100.7428254 unknown
InChI: InChI=1S/C9H16ClN3O/c10-8-5-1-2-7(8)6(3-5)4-12-13-9(11)14/h5-8,12-13H,1-4,11H2
charge 0 multiplicity 1
30 atoms
Cl 2.208536 -2.685569 -0.28363
O  -5.028333 0.395972 -1.169964
N  -1.812243 1.160303 0.302762
N  -3.088789 1.33186 -0.287625
N  -3.520462 -0.95175 0.030967
C  0.945605 -0.269583 0.657085
C  2.763635 0.11911 -0.689683
C  0.675584 1.173063 0.104867
C  1.616034 -0.912924 -0.581147
C  1.911838 1.417012 -0.85412
C  2.129183 -0.185185 1.664912
C  3.374139 0.100602 0.743025
C  -0.66707 1.338646 -0.633353
C  -3.952837 0.241321 -0.518339
H  0.04565 -0.774035 1.038378
H  3.487673 -0.052442 -1.500565
H  0.697805 1.891072 0.950066
H  0.980788 -0.995233 -1.475536
H  2.489155 2.317104 -0.581315
H  1.577421 1.5399 -1.902104
H  2.251107 -1.140157 2.202791
H  1.962176 0.608429 2.415183
H  3.868294 1.060271 0.976991
H  4.12621 -0.700641 0.836777
H  -0.774871 0.584792 -1.435277
H  -0.68727 2.340966 -1.125438
H  -1.716939 1.735375 1.153817
H  -3.338876 2.200422 -0.775009
H  -4.104656 -1.773915 -0.084048
H  -2.641289 -0.975683 0.546933
