program: Gaussian 09
title: 000274459
version: EM64L-G09RevD.01
frameworkgroup: C1[X(C9H14O2)]
method: RPBEPBE
basis: SDD
operation: Freq
keyword: #pfreq=noraman
keyword: PBEPBE/SDD
title: #p freq=noraman PBEPBE/SDD
converged: YES YES NO NO
title: Mulliken charges:
elementType: O O C C C C C C C C C H H H H H H H H H H H H H H
charge: -0.290131 -0.284958 -0.205416 -0.121399 0.344962 -0.494481 -0.547209 -0.447662 -0.463724 -0.329648 -0.334924 0.238429 0.232524 0.245219 0.219968 0.228000 0.254062 0.217394 0.234447 0.210024 0.221932 0.229246 0.207545 0.205722 0.230076
chargesum: 0.00000
title: Mulliken charges with hydrogens summed into heavy atoms:
elementType: O O C C C C C C C C C
charge: -0.290131 -0.284958 0.033013 0.111125 0.344962 -0.029294 -0.065147 0.004179 -0.031767 0.107144 0.100875
polarizability: 1.09301206e+02 -1.42982097e+00 8.74433594e+01 -2.78816450e+00 6.07273016e-01 8.38878760e+01
1716.lowfreq: -8.3069 -0.0006 -0.0004 0.0004 13.7190 18.2857 34.6136 94.4862 127.0134
frequency: 27.5307 94.4091 126.9923 223.2584 253.0056 349.1625 394.5320 437.6410 458.1508 465.5485 619.8322 698.2819 716.1632 754.3788 772.9868 791.5791 812.1210 828.2703 855.4631 886.3634 914.5960 921.7669 944.9859 951.9825 954.0737 968.9360 972.6666 976.0677 1037.6232 1059.5543 1068.1143 1089.7421 1111.3635 1122.7990 1147.0202 1165.7452 1170.2936 1186.1548 1200.6510 1224.0178 1236.9905 1247.8291 1266.3266 1290.7861 1297.5110 1307.0075 1308.5642 1320.9333 1328.0962 1451.1690 1465.5550 1466.3669 1482.9638 1487.3471 1494.1354 2981.2112 2996.9873 2998.9221 3013.3122 3016.2058 3026.7891 3057.3112 3060.8990 3068.1251 3072.9555 3084.0192 3089.2019 3090.7947 3098.1854
redmass: 1.8334 2.9649 3.1622 5.0330 2.0662 3.9998 1.9632 2.5539 2.7452 3.9399 3.9252 6.5094 7.5036 4.0111 2.0461 3.4150 1.7173 1.1900 2.3732 2.5421 4.0925 2.9834 1.7233 2.1159 2.0065 1.8828 7.1586 3.0456 1.5540 1.8223 2.1697 1.4315 1.5488 1.2336 1.6174 1.6119 1.1855 1.1388 1.7513 1.7544 1.3650 1.6460 1.3517 1.6618 1.5195 1.5544 1.2639 1.3306 1.6908 1.0835 1.0828 1.0897 1.0864 1.0962 1.0872 1.0645 1.0649 1.0599 1.0596 1.0632 1.0606 1.1009 1.0900 1.0999 1.0916 1.1047 1.1054 1.1038 1.1041
irintensity: 1.6034 0.3052 8.5347 2.8491 1.4820 9.5825 4.7059 0.3001 1.8558 5.0072 0.2753 1.5967 0.9184 8.2559 18.6805 18.8735 6.7255 1.4180 7.6389 6.3501 36.4256 10.9187 8.7739 22.3166 4.8042 4.2711 8.7796 20.1569 23.0159 27.1429 61.7705 20.0141 1.9742 15.2635 14.4319 11.2319 2.4040 0.6927 5.0230 8.5815 2.7946 7.5421 1.0165 4.5925 2.3238 7.1483 2.6178 3.0055 35.2204 10.4947 9.9203 11.3744 2.8520 5.1855 4.2709 31.1311 101.0117 33.7262 39.3191 58.0759 18.9280 26.4758 69.9914 4.1818 15.8010 12.5347 55.5133 57.0454 17.3374
temp: 298.150 k
press: 1.00000 atm
elementType: 8 8 6 6 6 6 6 6 6 6 6 1 1 1 1 1 1 1 1 1 1 1 1 1 1
symmnumber: 1
zpe: 567390.7 jmol-1
zpe.correction: 0.216108 hartree
zpe.thermalcorrener: 0.225382 hartree
zpe.thermalcorrenthalpy: 0.226326 hartree
zpe.thermalcorrgfe: 0.180895 hartree
zpe.sumelectzpe: -500.910559 hartree
zpe.sumelectthermal: -500.901285 hartree
zpe.sumelectthermalent: -500.900341 hartree
zpe.sumelectthermalfe: -500.945771 hartree
dipole: -0.6179 0.7177 1.3804
dipole: 1.6741
quadrupole: -57.8303 -69.7444 -66.3214
quadrupole: -2.7690 -2.2593 2.0497
quadrupole: 6.8017 -5.1124 -1.6893 -2.7690 -2.2593 2.0497
hfenergy: -501.1266664 hartree
pointgroup: C01 [X(C9H14O2)]
dipole: 0.2344588 0.243856 -0.565118 debye
dipolederiv: -0.9166887 -0.2236502 -0.0155936 -0.1472839 -0.6021461 -0.0681884 -0.0774553 -0.0346815 -0.4006894 -0.9698361 0.1293446 0.1062945 0.0713456 -0.5215842 -0.0233733 0.0319316 -0.0756337 -0.4183841 -0.1120115 -0.0149587 -0.0793435 0.0155802 -0.037963 -0.0073743 -0.142571 0.0079243 -0.0474816 0.14244 0.0326446 -0.0184808 0.0275553 0.1144743 -0.0286919 -0.0003272 -0.0360442 0.0511061 1.160903 0.0237998 0.0332769 -0.0362586 0.6756866 0.0800987 0.2786383 0.0942755 0.4992765 0.0339368 -0.0413132 0.066825 0.0007539 0.0045843 -0.0043171 0.0310847 -0.0295241 0.0140921 -0.1102821 -0.0340234 0.0533421 -0.0379426 0.0388948 0.04405 0.0316451 0.051574 -0.048793 -0.0012453 0.0185398 0.0609734 0.0006288 0.015279 -0.0235697 0.0090772 0.0018219 0.0962509 0.0979191 0.0141732 0.0277261 0.00024 -0.0066154 0.0625225 0.0374632 0.0525277 0.0742987 0.5314501 0.1514075 0.0077199 0.0133677 0.2098292 -0.0732161 -0.0710497 -0.1831772 0.2814362 0.5114414 -0.0383456 -0.0624935 0.1405243 0.1076316 -0.0681229 -0.0612294 0.0379537 0.3717964 -0.0392264 -0.0112533 0.1299382 -0.0077175 0.0497811 0.0241918 0.1237002 0.0221983 -0.0880137 -0.0915109 -0.1014979 0.0800798 -0.1052669 -0.0335317 0.077031 0.0754224 0.0742016 0.0153176 0.0577899 0.1084542 0.0255909 0.0737479 -0.1210599 -0.0346033 0.0153261 -0.0008318 0.0672825 -0.0895706 -0.0332274 -0.1417141 0.0057297 0.0767513 0.0233936 -0.1289206 -0.0154465 -0.0702886 0.0559253 -0.0098887 -0.0014715 0.0038823 0.0268784 -0.1324479 -0.0107041 -0.0688191 -0.0557013 0.0430162 0.0615126 -0.0321775 0.0482651 -0.0770017 0.0888089 -0.0239914 0.0307912 0.0678624 -0.0236447 0.054034 -0.0858719 0.0440253 0.0306326 0.0635401 -0.0787769 0.1091525 -0.1172249 0.0530565 -0.1076419 0.0051004 -0.0910254 -0.0733816 -0.024244 0.0004034 -0.0698518 0.0478329 0.0674562 -0.0110794 -0.0061592 0.0224084 -0.012927 -0.1016162 0.0595819 -0.1128856 -0.1214254 -0.196132 0.0347559 -0.0466095 0.0099179 0.0588403 0.0152744 -0.1097099 0.0220893 0.0273577 -0.0982033 -0.0821662 -0.0756462 -0.0597383 0.0451706 -0.027145 -0.1071058 -0.0601451 0.0005436 0.0159445 0.0038571 -0.0085518 -0.0254525 -0.0531028 0.097865 0.0853015 0.1605831 -0.0966186 0.0155222 -0.0036995 0.0041327 -0.0448694 0.0480601 0.0211499 0.1077557 -0.0214007 -0.2031926 -0.1384496 0.0802221 -0.0268868 0.0775829 0.0368192 0.0189843 -0.0754901 0.043348 0.0533596 unknown
polarizability: 109.207206|1.502144|87.3685415|-3.1170397|-0.9209056|84.0566943 unknown
InChI: InChI=1S/C9H14O2/c1-2-8-5-7(1)6-9(8)10-3-4-11-9/h7-8H,1-6H2
charge 0 multiplicity 1
25 atoms
O  1.171072 0.968423 0.856048
O  1.470264 -1.21294 0.109331
C  -0.437601 0.074025 -0.912556
C  -1.936177 -0.733425 0.612845
C  0.424803 -0.196175 0.359636
C  -1.443553 -1.111293 -0.819047
C  -0.59351 -0.720517 1.402743
C  -1.35197 1.302247 -0.624496
C  -2.401415 0.74049 0.407475
C  2.446674 0.993806 0.109818
C  2.646842 -0.474175 -0.393503
H  0.155126 0.149454 -1.839072
H  -2.702608 -1.392165 1.051928
H  -0.949313 -2.097317 -0.86553
H  -2.238768 -1.059985 -1.583884
H  -0.613735 -0.064506 2.288517
H  -0.29038 -1.733258 1.718896
H  -1.842672 1.638081 -1.55576
H  -0.771973 2.146801 -0.216251
H  -2.399959 1.306952 1.355736
H  -3.426796 0.775912 -0.003786
H  3.222799 1.32546 0.818074
H  2.38616 1.706983 -0.734989
H  2.691951 -0.520135 -1.498836
H  3.536836 -0.965143 0.031964
