program: Gaussian 09
title: 000274454
version: EM64L-G09RevD.01
frameworkgroup: C1[X(C9H12O3)]
method: RPBEPBE
basis: SDD
operation: Freq
keyword: #pfreq=noraman
keyword: PBEPBE/SDD
title: #p freq=noraman PBEPBE/SDD
converged: YES YES NO NO
title: Mulliken charges:
elementType: O O O C C C C C C C C C H H H H H H H H H H H H
charge: -0.252464 -0.185911 -0.245643 0.099860 -0.553993 0.110282 -0.733332 -0.136314 0.226681 -0.305742 -0.261286 -0.661708 0.237550 0.280723 0.217838 0.224099 0.269673 0.241842 0.270698 0.221828 0.232459 0.213187 0.248962 0.240711
chargesum: 0.00000
title: Mulliken charges with hydrogens summed into heavy atoms:
elementType: O O O C C C C C C C C C
charge: -0.252464 -0.185911 -0.245643 0.099860 -0.035720 0.110282 -0.021722 0.105528 0.226681 -0.035044 0.193000 0.041151
polarizability: 1.19675835e+02 7.26829864e+00 1.01121521e+02 9.54112576e+00 3.44572749e+00 8.53073239e+01
1716.lowfreq: -16.5078 -10.1829 -0.0008 0.0002 0.0005 3.4166 37.8710 52.4682 55.8441
frequency: 37.2144 52.4141 55.7057 87.0053 162.5889 175.0652 222.9520 236.9700 242.8347 280.0357 314.2276 334.4603 366.0432 435.5215 465.7919 524.1446 621.8307 645.5701 702.3611 726.7995 743.5696 797.3759 813.4866 820.0760 874.7259 909.9556 932.1028 971.5890 982.1089 1008.0107 1062.8684 1083.2519 1097.4548 1103.0814 1133.5707 1150.6023 1158.7171 1195.5215 1243.6248 1276.1580 1297.5692 1328.9157 1352.2415 1385.3884 1394.6392 1435.4786 1458.2856 1462.4650 1469.4045 1474.6431 1484.7901 1596.7169 1605.8864 1638.0126 2989.3219 2992.6022 2995.4854 3029.4204 3041.5561 3084.8657 3091.4175 3096.4396 3118.8861 3121.6355 3154.1152 3197.7438
redmass: 4.5327 5.0505 2.9610 4.0982 4.6943 1.7110 1.4815 3.1927 1.1462 3.2463 2.8442 3.6602 2.5638 4.0381 3.8074 4.3256 5.0897 3.7349 2.8996 4.0553 4.3675 2.2861 2.1824 1.6302 2.5537 2.0720 1.8403 1.3635 1.9712 2.5505 1.6038 2.4748 2.1188 1.5852 2.4487 2.3622 1.7533 2.4500 2.3250 1.1218 1.7385 1.8259 1.2822 1.1853 1.2263 1.1081 1.0967 1.0471 1.0506 1.0554 1.0527 5.7344 9.3467 11.4770 1.0542 1.0418 1.0364 1.0598 1.1006 1.1007 1.0980 1.1028 1.0996 1.1056 1.0900 1.1051
irintensity: 3.3943 5.2755 0.7253 0.9691 2.4389 2.1093 0.1065 2.4402 0.1545 0.3499 9.0101 6.8607 12.1845 1.2216 5.2234 1.9021 8.3306 16.6149 19.2916 2.8485 20.0130 10.2401 29.8152 5.1979 6.1198 0.9429 7.4382 3.5997 24.9808 26.6784 57.3783 113.7539 32.6133 55.2812 196.5652 40.0094 7.4198 21.1307 46.5443 4.4024 8.2068 13.5066 1.7473 14.1059 25.1679 44.3859 18.9427 13.7013 4.6624 22.7968 16.8569 23.4192 198.0919 159.1348 5.9281 34.6170 15.3054 33.7219 6.0129 23.9979 31.6311 3.5473 7.9151 29.0070 9.2566 8.7845
temp: 298.150 k
press: 1.00000 atm
elementType: 8 8 8 6 6 6 6 6 6 6 6 6 1 1 1 1 1 1 1 1 1 1 1 1
symmnumber: 1
zpe: 504497.0 jmol-1
zpe.correction: 0.192153 hartree
zpe.thermalcorrener: 0.204712 hartree
zpe.thermalcorrenthalpy: 0.205656 hartree
zpe.thermalcorrgfe: 0.152515 hartree
zpe.sumelectzpe: -574.900629 hartree
zpe.sumelectthermal: -574.888069 hartree
zpe.sumelectthermalent: -574.887125 hartree
zpe.sumelectthermalfe: -574.940266 hartree
dipole: -1.1846 -2.0628 0.4347
dipole: 2.4182
quadrupole: -53.5361 -76.2514 -73.3756
quadrupole: 2.4214 3.0594 -4.9300
quadrupole: 14.1850 -8.5304 -5.6546 2.4214 3.0594 -4.9300
hfenergy: -575.0927815 hartree
pointgroup: C01 [X(C9H12O3)]
dipole: 0.3683824 0.8453709 -0.2340156 debye
dipolederiv: -1.4698603 -0.2206208 0.2106852 -0.1929363 -0.3421194 -0.0459327 0.3369136 -0.0194932 -0.5341639 -0.5033713 -0.1867972 0.2192648 -0.0078045 -0.7146868 0.2924919 0.1210006 0.3313435 -0.5887452 -0.6923481 -0.0484642 -0.1595622 -0.1027476 -0.2775799 -0.0844685 0.0755269 0.0506487 -0.9357235 -0.4745436 0.1858702 -0.1662117 0.295611 -0.2677368 0.1281044 -0.1927335 0.0478882 -0.1212028 -0.0349934 0.1252649 0.0173602 0.0651695 -0.0717441 0.0851722 -0.0398898 0.0928284 -0.0331739 0.877713 0.107959 -0.470875 -0.4569741 0.8259325 -0.3602719 -0.2503014 -0.4709436 0.561022 0.0254585 -0.0105852 0.0361176 -0.0258078 0.0914769 -0.0208682 0.0399591 0.0654019 0.049158 0.0904722 -0.150377 -0.0481132 0.0402387 0.2642928 -0.2319953 -0.1584114 -0.1767792 0.0578612 1.7507237 0.075996 0.060503 0.2266924 0.0837495 0.1037472 -0.334212 -0.0776809 1.1626303 -0.427888 -0.2276455 0.2440713 -0.0430586 -0.1563195 0.0548042 0.1813985 0.1398178 -0.3462602 0.8282623 0.157414 -0.0245907 0.1631608 0.3880109 0.0328364 0.1471001 0.02485 0.2434612 -0.0782942 -0.0221839 0.0170033 -0.0434586 -0.1595777 -0.0361186 -0.0358243 -0.0100658 0.0340865 0.0268257 -0.0321105 -0.0198773 -0.0717341 -0.0822652 -0.0350127 -0.0103079 -0.1049591 0.1085648 0.1392273 0.0761429 -0.0684105 0.0354991 0.1013107 0.0048962 0.001471 0.0055435 -0.0110053 -0.1169252 -0.0506659 -0.1153432 -0.0217504 0.0712248 -0.0282577 -0.0740006 -0.0281773 0.0363248 0.0711111 0.0891854 -0.0033018 0.0776007 -0.1042058 -0.0005903 -0.016455 0.0402104 0.0435579 0.06034 -0.0160063 0.0861605 -0.045116 0.0551062 0.0682755 0.0867919 0.0155796 0.0310327 -0.056232 0.0189359 0.0961146 0.0128558 0.1065882 0.0158542 0.1039321 0.0189899 0.0823914 0.0249643 0.0920321 0.0310394 0.1067081 0.026542 0.0347392 0.0427324 0.0423224 0.1561893 -0.0710646 0.0282721 0.061088 0.0319731 0.0113869 -0.0671801 0.0981157 -0.0914974 0.0032563 0.014826 -0.0369928 0.0126687 -0.0139073 -0.0062748 0.0688399 -0.1179775 0.0835816 -0.0381385 -0.151705 -0.0746604 -0.0664526 -0.0900193 0.0673778 -0.0088213 -0.0784306 -0.0200055 0.1031912 0.0385694 0.0774302 0.1010397 0.0438958 0.0541256 -0.0219304 0.1037896 -0.0474975 0.0026352 0.128732 0.0426071 -0.0503782 0.0159093 0.0353854 0.0516864 -0.0301874 0.0880934 -0.0669494 unknown
polarizability: 119.5106814|5.1915861|95.2822526|-9.7547229|-9.8263845|91.3117468 unknown
InChI: InChI=1S/C9H12O3/c1-3-12-8(11)9(2)6-4-5-7(9)10/h4-5H,3,6H2,1-2H3
charge 0 multiplicity 1
24 atoms
O  -2.043732 0.617156 0.53683
O  0.348998 -1.331721 1.538644
O  -1.128562 0.524764 -1.602231
C  0.350287 0.897283 0.350531
C  1.417823 1.451177 -0.636491
C  0.918753 -0.527433 0.761052
C  0.209814 1.741194 1.644215
C  2.519004 0.410594 -0.658895
C  -0.990663 0.676651 -0.362477
C  2.234672 -0.685932 0.102731
C  -3.381998 0.237143 -0.019675
C  -3.499021 -1.28488 -0.131655
H  1.801227 2.437749 -0.313079
H  0.992408 1.580021 -1.649917
H  1.20152 1.88124 2.111623
H  -0.216343 2.734899 1.420604
H  -0.450895 1.228377 2.360316
H  3.433905 0.548866 -1.245202
H  2.852942 -1.575339 0.242057
H  -4.089636 0.65703 0.712642
H  -3.506442 0.728772 -1.000707
H  -4.526941 -1.557827 -0.434818
H  -2.799779 -1.677503 -0.888513
H  -3.279638 -1.76508 0.836916
