program: Gaussian 09
title: 000274452
version: EM64L-G09RevD.01
frameworkgroup: C1[X(C9H11ClO2)]
method: RPBEPBE
basis: SDD
operation: Freq
keyword: #p
keyword: freq=noraman
keyword: PBEPBE/SDD
title: #p freq=noraman PBEPBE/SDD
converged: NO YES NO NO
title: Mulliken charges:
elementType: Cl O O C C C C C C C C C H H H H H H H H H H H
charge: -0.058177 -0.254389 -0.290020 0.368541 -0.279411 -0.187853 -0.506103 -0.505958 -0.186711 -0.222940 -0.336088 -0.303685 0.270479 0.271617 0.316387 0.256622 0.252412 0.243332 0.245649 0.236520 0.228588 0.226161 0.215024
chargesum: 0.00000
title: Mulliken charges with hydrogens summed into heavy atoms:
elementType: Cl O O C C C C C C C C C
charge: -0.058177 -0.254389 -0.290020 0.368541 -0.008932 0.083765 -0.189716 0.003076 0.056621 0.022709 0.129020 0.137500
polarizability: 1.13413618e+02 2.80345491e+00 1.08369592e+02 4.16068619e+00 1.03565298e+00 8.24091387e+01
1716.lowfreq: -21.7887 -10.6435 -0.0022 -0.0011 -0.0011 8.9793 60.0140 80.4857 172.0881
frequency: 59.9396 80.4400 172.0796 185.0898 194.9380 271.0287 303.9680 346.1710 405.5205 427.1114 491.9233 551.2299 623.5998 682.5800 699.6366 732.0412 749.4112 757.9446 827.8089 860.4468 897.1185 898.5585 909.7164 920.2685 927.7133 940.5807 954.6338 976.6930 981.4945 991.5445 999.7336 1065.8148 1081.4437 1098.5400 1119.2906 1125.5842 1159.6775 1167.8268 1194.0030 1202.5393 1210.6239 1248.6976 1250.9118 1264.7064 1278.7381 1313.1362 1318.1324 1324.3278 1465.8091 1473.1241 1478.2491 1584.6992 3001.0497 3007.5802 3031.5392 3087.4972 3107.3316 3109.4816 3113.5566 3115.3842 3122.4470 3169.3030 3203.8246
redmass: 3.6332 4.3462 3.0463 4.0059 6.7971 3.9384 7.9441 3.9633 4.0392 4.0344 2.1627 3.8734 2.4315 3.9396 5.2417 2.7272 2.6647 5.2957 4.1973 2.1965 2.4079 2.3975 3.3928 2.3464 1.8443 3.1371 2.1921 3.2207 3.0752 1.9276 1.8551 2.3723 1.5105 1.5194 1.4515 1.7151 1.2261 2.0122 1.2891 1.3281 1.2889 1.4410 1.6050 1.4364 1.6667 1.5902 1.3397 1.2522 1.0986 1.0902 1.0964 5.8992 1.0643 1.0626 1.0594 1.1028 1.0901 1.1059 1.1038 1.0912 1.0912 1.0884 1.1092
irintensity: 8.5288 2.5456 1.2987 0.9987 1.9902 2.3877 1.6850 6.2219 3.7650 2.7750 3.6825 9.8999 2.1911 32.1834 13.2455 60.5910 57.6434 2.1305 16.0704 0.5843 16.7338 17.0511 22.8783 32.2826 2.8171 8.7197 3.5217 24.1163 8.7414 4.1246 5.0392 52.0334 18.1501 15.7413 4.8592 53.9154 4.4816 32.5773 5.1104 1.5475 2.9050 8.3433 10.5981 5.2881 29.7973 17.4587 1.7802 1.1890 13.9622 6.9507 1.5047 0.6493 70.9127 36.9030 23.8625 27.3594 23.0886 21.4048 18.1073 21.1481 1.1722 5.0114 15.4539
temp: 298.150 k
press: 1.00000 atm
elementType: 17 8 8 6 6 6 6 6 6 6 6 6 1 1 1 1 1 1 1 1 1 1 1
symmnumber: 1
zpe: 480395.4 jmol-1
zpe.correction: 0.182973 hartree
zpe.thermalcorrener: 0.193019 hartree
zpe.thermalcorrenthalpy: 0.193964 hartree
zpe.thermalcorrgfe: 0.147001 hartree
zpe.sumelectzpe: -959.093375 hartree
zpe.sumelectthermal: -959.083328 hartree
zpe.sumelectthermalent: -959.082384 hartree
zpe.sumelectthermalfe: -959.129346 hartree
dipole: 0.7571 -1.7098 -0.3929
dipole: 1.9107
quadrupole: -65.5653 -80.9115 -78.3375
quadrupole: -2.7345 0.4041 -1.7832
quadrupole: 9.3728 -5.9734 -3.3994 -2.7345 0.4041 -1.7832
hfenergy: -959.2763477 hartree
pointgroup: C01 [X(C9H11Cl1O2)]
dipole: -0.3159648 0.6390924 -0.2383956 debye
dipolederiv: -0.3115397 -0.1998367 0.0207229 -0.1624867 -0.6451563 0.0595183 0.0364206 0.1253226 -0.1772936 -0.9980856 0.014661 0.042517 -0.0216414 -0.4126502 0.0816965 0.0605237 0.0412272 -0.4384358 -0.9828358 0.2586291 -0.1300227 0.173718 -0.4633936 0.114023 -0.1897097 0.1208036 -0.4711486 1.1326668 -0.2771056 0.0823002 -0.1055313 0.5913577 -0.1091186 0.1532272 -0.0364535 0.4460592 -0.110797 -0.0217775 -0.0031724 -0.1008003 -0.0132795 0.0905444 -0.0561623 0.1017469 0.033695 0.0677723 -0.1128908 0.0232723 -0.0615261 0.0086654 0.0519301 0.090966 0.0688312 -0.0239174 0.2123699 0.4251287 -0.0452232 0.3009628 0.5337688 -0.1180927 -0.0460141 -0.2118242 0.1110746 0.0458285 0.082831 0.0166315 0.0563259 -0.0183517 -0.0492274 0.014347 -0.02837 0.0367263 -0.0503365 -0.0700749 -0.1563903 -0.056069 -0.0158849 -0.0689836 -0.1780281 -0.1583672 -0.0659714 -0.239014 -0.0321795 -0.1211027 0.025167 0.0016617 -0.0756024 -0.2073474 -0.0706579 -0.0265568 0.5025021 0.0411074 0.0074646 -0.0136624 0.2612377 0.0543732 0.2015495 0.0633765 0.2241455 0.6380049 -0.2187896 0.0908891 -0.0655704 0.2434248 0.0913208 -0.1142212 0.1261324 0.2043953 0.0349364 0.0553884 0.0517819 0.0526321 -0.0390653 -0.0731924 0.0488663 -0.0878281 0.011184 -0.0105432 0.0854292 0.0102327 0.0961462 -0.0630644 -0.0182875 -0.0010014 -0.0118316 0.0745668 0.0244499 -0.0419603 -0.0146191 -0.034577 -0.0245833 0.0185291 -0.0138 -0.0078291 -0.0488253 0.0683725 -0.0597147 0.0905266 -0.054602 0.0337137 0.0931414 0.06211 0.0721401 0.0011314 -0.1005536 -0.0424986 -0.1195031 -0.0547249 0.0490205 -0.0523167 -0.0761058 -0.0305752 0.0280657 0.1309898 0.0340274 0.0431081 -0.0095733 -0.0369571 0.084026 0.0724034 0.1042216 0.0905324 0.0839879 -0.0100976 0.1229879 0.0039849 0.0733044 0.0087407 0.1619997 0.0223414 -0.0006124 -0.0701281 0.0052351 0.0825604 0.0248303 0.0925945 -0.0308659 0.1184729 -0.0083924 0.007138 0.0288835 -0.0031392 -0.0134077 -0.0848853 -0.0999136 -0.0577084 -0.0881267 -0.0768372 0.0076637 -0.0497102 0.0217566 -0.0925621 -0.0118628 0.0834107 -0.0459891 -0.135636 -0.0093089 -0.0567002 -0.0472209 0.0658709 0.0110081 0.1037456 -0.1398603 -0.0484589 0.0852664 -0.1078682 0.0330836 unknown
polarizability: 113.3204112|2.4603856|107.8609186|-4.1723079|-4.3083598|83.0110188 unknown
InChI: InChI=1S/C9H11ClO2/c10-8-6-1-2-7(5-6)9(8)11-3-4-12-9/h1-2,6-8H,3-5H2
charge 0 multiplicity 1
23 atoms
Cl -0.265285 -2.663341 0.118888
O  -1.394466 -0.084442 1.122184
O  -1.120575 0.940569 -0.979151
C  -0.400329 0.240252 0.104873
C  0.734114 1.083921 0.773164
C  1.858633 -0.751048 0.008544
C  0.397005 -0.995453 -0.494132
C  1.585756 -0.071694 1.390292
C  1.657273 1.551174 -0.36328
C  2.338555 0.458823 -0.813312
C  -2.690355 -0.172624 0.410318
C  -2.563944 0.956762 -0.629409
H  0.33293 1.852666 1.446299
H  2.490843 -1.648644 -0.010323
H  0.29528 -1.051323 -1.585575
H  1.013589 -0.710842 2.08444
H  2.50748 0.29323 1.870923
H  1.670363 2.562383 -0.774236
H  3.016461 0.398486 -1.668207
H  -3.479297 -0.013759 1.160601
H  -2.793858 -1.167175 -0.062915
H  -3.133999 0.777302 -1.555509
H  -2.828174 1.941675 -0.200576
