program: Gaussian 09
title: 000274450
version: EM64L-G09RevD.01
frameworkgroup: C1[X(C9H9NO3)]
method: RPBEPBE
basis: SDD
operation: Freq
keyword: #pfreq=noraman
keyword: PBEPBE/SDD
title: #p freq=noraman PBEPBE/SDD
converged: YES YES NO NO
title: Mulliken charges:
elementType: O O O N C C C C C C C C C H H H H H H H H H
charge: -0.199594 -0.406660 -0.228785 -0.248535 -0.024614 -0.529736 0.318777 -0.533270 0.025418 -0.226461 -0.371471 -0.276828 0.196460 0.279338 0.272616 0.247316 0.275706 0.268614 0.255955 0.271367 0.250148 0.384238
chargesum: 0.00000
title: Mulliken charges with hydrogens summed into heavy atoms:
elementType: O O O N C C C C C C C C C
charge: -0.199594 -0.022422 -0.228785 -0.248535 0.254723 -0.009804 0.318777 0.011051 0.025418 0.029494 -0.100104 -0.026679 0.196460
polarizability: 1.31426778e+02 -7.42854039e+00 1.27439839e+02 -6.35717708e+00 -8.76745550e-01 6.85136761e+01
1716.lowfreq: -6.6901 -3.9630 -0.0006 -0.0003 0.0003 8.8626 24.6538 40.3373 60.6874
frequency: 24.6067 40.1619 60.6170 99.8157 160.9159 183.9536 257.8039 301.5250 330.3860 467.4421 494.0524 512.3125 541.5952 572.6996 587.0494 605.1246 635.1539 645.4711 667.6956 745.1472 759.3522 817.2166 867.7758 884.2955 891.9010 895.7850 908.4632 999.5459 1026.4714 1031.5789 1046.6941 1068.4579 1107.7536 1135.2718 1146.8932 1212.2682 1221.8942 1241.8635 1253.1093 1279.6434 1307.7635 1327.0533 1369.4058 1383.0273 1414.1453 1434.6470 1443.2593 1454.3116 1533.3482 1641.6340 1662.4346 3000.7090 3023.8679 3026.7673 3065.2804 3090.1737 3206.9440 3225.6394 3240.6385 3512.7598
redmass: 10.2941 3.9613 3.7427 3.8702 5.1649 6.2008 4.7432 4.1036 5.1850 3.0304 1.9809 3.0771 3.6132 4.2294 7.7168 3.0122 5.0922 1.4084 3.7093 1.2477 5.5655 1.4004 3.6235 1.8027 4.2340 1.5661 2.5703 2.3780 1.8338 2.0314 2.1229 2.3313 1.8849 2.2820 1.3960 1.2803 1.5338 1.4358 1.5048 1.5775 4.2342 1.5411 1.8812 5.6343 4.1915 1.0973 1.1652 3.0065 6.9478 12.2288 8.4250 1.0626 1.0685 1.0808 1.0976 1.1001 1.0904 1.0985 1.1071 1.0641
irintensity: 1.4017 2.9977 0.6060 0.8781 0.3901 4.3546 1.4703 5.3217 6.0874 20.8438 13.6511 6.1567 10.3763 30.6487 9.6024 14.4335 9.4691 133.3724 4.0828 88.6846 14.3446 14.3704 1.6393 5.9596 1.7012 3.3144 9.0654 40.1416 15.3571 2.8114 241.0057 77.2027 29.1055 2.3060 15.2431 0.2811 7.0052 5.1526 5.0768 4.7238 106.1073 21.7890 82.5062 39.3338 13.8972 33.1289 12.4814 32.9404 27.7836 402.3547 206.4834 6.9478 8.7652 7.5685 5.5697 5.9835 2.9786 0.8853 2.7978 29.9349
temp: 298.150 k
press: 1.00000 atm
elementType: 8 8 8 7 6 6 6 6 6 6 6 6 6 1 1 1 1 1 1 1 1 1
symmnumber: 1
zpe: 437196.7 jmol-1
zpe.correction: 0.166519 hartree
zpe.thermalcorrener: 0.177839 hartree
zpe.thermalcorrenthalpy: 0.178783 hartree
zpe.thermalcorrgfe: 0.127046 hartree
zpe.sumelectzpe: -627.838736 hartree
zpe.sumelectthermal: -627.827417 hartree
zpe.sumelectthermalent: -627.826472 hartree
zpe.sumelectthermalfe: -627.878210 hartree
dipole: -3.0356 -4.3390 -0.0927
dipole: 5.2963
quadrupole: -70.2312 -81.2613 -78.9790
quadrupole: -7.4460 4.3687 -0.9689
quadrupole: 6.5926 -4.4375 -2.1552 -7.4460 4.3687 -0.9689
hfenergy: -628.0052554 hartree
pointgroup: C01[X(C9H9N1O3)]
dipole: 1.1226184 1.7425501 -0.212491 debye
dipolederiv: -0.5671808 -0.3275809 -0.0357056 -0.1400472 -1.2942436 -0.0406736 -0.0562193 -0.1090853 -0.3404519 -0.9070085 -0.2162908 0.5182975 -0.1680055 -0.4274814 0.0830289 0.5233409 0.0992275 -0.7397531 -0.7234109 0.0847093 -0.1634363 -0.0274962 -0.4016674 0.2534595 0.1137476 0.2208137 -0.8248489 -0.815466 0.1940861 -0.0835461 0.1631944 0.2303391 0.0470011 -0.0519774 0.0657685 -0.1290562 0.6448011 -0.0093313 0.0197413 -0.1157417 0.1706261 -0.0139208 -0.0266412 0.0002757 0.2753864 -0.4608737 -0.1062321 -0.0865413 0.0084956 -0.035301 0.0004143 -0.1119663 -0.0121655 0.0693138 0.0497317 0.4526373 0.0244095 0.3766466 -1.0245764 0.0228869 0.0318189 0.0626947 -0.028468 -0.3314301 0.0671363 -0.0459966 0.1719374 0.0396739 0.1027781 -0.1466227 0.0966801 -0.0314772 0.9998495 -0.0475898 0.1407918 -0.0448546 1.827913 0.0403875 0.1891252 0.0489886 0.1792647 0.1996544 0.1996346 0.0706354 -0.2085209 -0.2056926 -0.0138918 0.0625084 0.0477644 -0.1358624 -0.0436058 -0.1315756 0.0425728 0.0380869 0.3072276 0.0198494 0.0265032 -0.0089645 -0.1685461 -0.1012198 -0.2702481 0.0375303 -0.0274005 -0.2120782 -0.0026041 0.0335476 -0.0601623 -0.2324993 1.5077083 0.0087563 -0.2140058 -0.0143104 0.3919236 -0.4541734 -0.3838589 -0.4316985 1.2389111 -0.0050335 -0.0011201 -0.0400963 -0.0231138 0.0284158 -0.0356925 -0.0467646 -0.03989 -0.0591233 0.0895506 0.0170926 -0.0337232 -0.0203033 0.0522512 0.040832 -0.0413615 0.0770345 -0.0043386 0.0162116 0.0506168 0.0642394 0.01728 0.065439 -0.0328297 0.0996416 -0.0651001 0.0015688 0.064649 -0.0076305 -0.0244672 -0.0196415 0.0824896 -0.0692921 0.0086561 -0.0330645 -0.0203614 0.0679363 0.0142242 0.000153 -0.0347641 -0.0635644 0.0134946 0.0232572 -0.0060497 0.1095242 0.0528407 -0.0853663 -0.0392365 -0.0562766 0.0342193 -0.0178807 -0.0436111 -0.0212393 0.1910945 0.020314 -0.037204 -0.0384399 -0.0575185 0.091042 -0.0181336 -0.0432689 -0.0119622 0.1915334 0.0377757 0.0911189 -0.0273269 0.09181 -0.0032858 0.0103024 -0.0306431 0.0112661 0.19011 0.204206 0.0601573 -0.0858495 0.090544 0.3463306 0.0646576 -0.1292117 0.0688681 0.2680795 unknown
polarizability: 132.1793763|-6.6850947|126.5640673|6.1547438|-4.1686421|68.6368503 unknown
InChI: InChI=1S/C9H9NO3/c11-8-4-6(5-9(12)13)10-3-1-2-7(8)10/h1-3,6,12H,4-5H2
charge 0 multiplicity 1
22 atoms
O  -1.744324 -2.781608 -0.091807
O  3.886745 0.618532 -1.080971
O  3.324947 -0.248892 1.000175
N  -0.834467 0.651519 0.224907
C  0.520943 0.111934 0.515507
C  0.300387 -1.428659 0.40837
C  -1.80867 -0.328221 -0.025152
C  1.563289 0.675915 -0.473247
C  -1.203584 -1.653275 0.067194
C  -1.400817 1.904965 0.159568
C  -3.033931 0.33122 -0.261731
C  -2.775382 1.732564 -0.144961
C  2.974423 0.285368 -0.074746
H  0.818785 0.390745 1.542413
H  0.549346 -1.94691 1.34916
H  0.920434 -1.885499 -0.38384
H  1.364764 0.329767 -1.503665
H  1.51933 1.782306 -0.506294
H  -0.834546 2.818574 0.33251
H  -3.983227 -0.150951 -0.485793
H  -3.496954 2.539865 -0.263766
H  4.807209 0.369841 -0.79293
