program: Gaussian 09
title: 000274448
version: EM64L-G09RevD.01
frameworkgroup: C1[X(C9H8O4)]
method: RPBEPBE
basis: SDD
operation: Freq
keyword: #p
keyword: freq=noraman
keyword: PBEPBE/SDD
title: #p freq=noraman PBEPBE/SDD
converged: NO YES NO NO
title: Mulliken charges:
elementType: O O O O C C C C C C C C C H H H H H H H H
charge: -0.195352 -0.155964 -0.149504 -0.145663 -0.176583 -0.284030 -0.251631 -0.286125 -0.530346 -0.539262 0.128321 0.154681 0.168909 0.289356 0.314158 0.296051 0.315206 0.268630 0.256063 0.270613 0.252471
chargesum: 0.00000
title: Mulliken charges with hydrogens summed into heavy atoms:
elementType: O O O O C C C C C C C C C
charge: -0.195352 -0.155964 -0.149504 -0.145663 0.112772 0.030128 0.044421 0.029081 -0.005652 -0.016178 0.128321 0.154681 0.168909
polarizability: 1.09490808e+02 -3.34077586e+00 1.07850778e+02 3.52096133e+00 9.34206407e-01 7.16968856e+01
1716.lowfreq: -9.9234 -0.0010 -0.0008 -0.0006 8.6365 18.7118 65.3060 117.2179 128.3506
frequency: 65.1658 117.1674 128.3445 166.7502 177.9004 300.1317 383.7625 403.8221 457.4635 474.5351 527.5114 559.7139 571.9801 602.5619 632.3663 679.1540 759.0926 774.8868 790.1594 807.1760 828.7039 865.4395 905.1656 912.2696 926.0026 949.6528 969.1574 1015.1563 1016.8833 1052.6924 1085.0867 1104.2694 1127.1561 1139.6526 1149.5980 1167.0203 1205.7150 1235.6070 1240.7500 1251.9899 1279.7945 1286.9828 1297.1940 1299.1039 1429.1163 1494.3756 1681.9191 1700.4667 1768.5047 3008.5552 3030.1968 3053.6345 3065.6927 3076.0504 3096.1089 3101.7665 3125.2430
redmass: 6.3771 6.9180 15.4817 8.0900 5.0317 3.7019 4.3983 5.5227 2.6708 4.5457 4.8261 3.0820 11.1793 6.8573 5.7988 5.7061 4.9934 4.8951 5.3317 5.9031 5.0677 2.3885 2.5914 3.5332 2.2050 2.0540 2.0790 1.5319 1.6820 3.2196 1.3418 1.6753 2.5633 2.5986 1.9286 1.7998 1.3828 1.4918 1.5175 1.4332 1.4414 1.4982 1.6607 1.6122 1.0812 1.0904 11.9701 13.0035 12.8293 1.0622 1.0611 1.0855 1.0874 1.0998 1.1062 1.0906 1.0918
irintensity: 4.3147 9.6937 1.7753 5.5754 3.3150 3.9672 4.3095 9.0729 0.6425 0.6103 10.6886 4.6515 1.7558 14.4234 6.1645 8.0447 8.4799 12.9269 20.4436 83.7802 177.3287 42.9409 10.7247 10.2799 6.3738 9.5894 6.2768 5.6071 6.5323 87.5523 38.2475 40.5353 55.4646 97.0447 14.6188 9.2304 0.6889 2.7468 4.4125 2.6943 0.2686 2.7970 8.9510 3.0162 21.1097 14.6778 236.5628 478.8505 119.1741 8.6142 15.4107 2.6166 5.1402 8.5313 16.0459 13.2649 2.4790
temp: 298.150 k
press: 1.00000 atm
elementType: 8 8 8 8 6 6 6 6 6 6 6 6 6 1 1 1 1 1 1 1 1
symmnumber: 1
zpe: 408658.2 jmol-1
zpe.correction: 0.155650 hartree
zpe.thermalcorrener: 0.165483 hartree
zpe.thermalcorrenthalpy: 0.166427 hartree
zpe.thermalcorrgfe: 0.119925 hartree
zpe.sumelectzpe: -647.709654 hartree
zpe.sumelectthermal: -647.699821 hartree
zpe.sumelectthermalent: -647.698877 hartree
zpe.sumelectthermalfe: -647.745379 hartree
dipole: -2.8588 -2.6849 0.0827
dipole: 3.9228
quadrupole: -98.4457 -83.8299 -68.1334
quadrupole: 6.7471 -5.6871 -0.2118
quadrupole: -14.9760 -0.3602 15.3363 6.7471 -5.6871 -0.2118
hfenergy: -647.865304 hartree
pointgroup: C01 [X(C9H8O4)]
dipole: 1.1284558 1.0528563 -0.0077127 debye
dipolederiv: -0.665608 0.2234813 0.0328057 0.2806853 -1.7204951 0.1339067 0.1462923 0.1609335 -0.2067585 -0.8925372 0.2242146 0.1925862 0.2672314 -0.5575434 -0.0706011 0.3011225 -0.0781099 -0.3721874 -0.6950681 0.3336303 -0.0153101 0.3295813 -0.9491808 0.0690868 0.0731592 -0.0010033 -0.3018839 -0.5214959 -0.1499991 0.0321486 -0.1622528 -1.1199763 0.0626264 0.1022791 0.1609864 -0.3121767 0.1847224 0.0245451 0.0326212 0.0670704 0.1159942 0.0325536 0.1279898 0.068443 0.0965179 -0.2904119 -0.0516432 0.1683007 -0.1385839 -0.0162198 0.0326497 0.223914 0.0392422 0.0298772 -0.3968341 -0.0400641 0.01637 -0.0526331 -0.0617887 -0.022525 0.0174526 -0.0117801 0.0617227 -0.3668551 -0.0941063 0.0422768 -0.1520758 -0.0544386 0.0522861 0.1415292 0.0379129 0.0577252 0.0473453 0.0089102 0.0158156 -0.0330483 -0.0224661 0.041363 0.0052673 0.0103325 -0.0131719 -0.0142851 0.0152457 0.0362715 0.0406724 -0.4375044 -0.001968 0.0340344 0.0081101 0.0772047 1.1277194 -0.1927054 -0.3678715 -0.0933862 0.8872822 -0.0227865 -0.5490564 -0.0043499 0.2315445 1.0815308 0.0196006 -0.08831 -0.4223813 1.8351208 -0.1891877 -0.2130823 -0.2665272 0.2694188 1.1695 -0.3452199 -0.0809774 0.0672674 1.8605981 -0.1162361 -0.3597271 -0.1154523 0.2633894 0.0393709 0.0576483 0.009454 0.0291371 -0.0766445 -0.0389366 -0.001834 -0.0398985 0.0692476 0.0660847 0.0049604 -0.0044467 0.0253785 -0.0446167 0.0388111 -0.0025061 0.0271187 0.0646113 0.0732256 -0.0082499 0.0190442 0.021671 0.0473222 0.0520897 -0.0007246 0.0580813 -0.0343637 0.0843627 0.0178659 0.0172883 -0.0116306 0.0377063 -0.0433653 0.0056614 -0.0575912 -0.0053583 -0.06924 -0.0201504 0.1142164 -0.0130845 0.0553836 0.0165663 0.0787479 0.0189026 0.0563331 -0.0123537 -0.0275083 -0.1316866 -0.0273099 0.0748851 -0.0353219 -0.0964494 -0.0266195 -0.0155575 -0.0251108 -0.0381066 -0.0599811 -0.0240336 0.070088 -0.0259952 -0.0836788 -0.0625398 0.0518223 0.075938 0.0376509 0.0193842 0.001725 0.076494 0.0349838 0.0496093 0.0738085 -0.0679567 unknown
polarizability: 109.3584662|-3.4500858|107.814269|-3.9977964|-1.6861804|71.8657364 unknown
InChI: InChI=1S/C9H8O4/c10-5-2-3-1-4(5)7-6(3)8(11)13-9(7)12/h3-4,6-7H,1-2H2
charge 0 multiplicity 1
21 atoms
O  -2.364315 -0.331718 0.11865
O  3.297848 -0.82969 -0.615915
O  -2.503999 1.98038 -0.18565
O  -1.617616 -2.544021 0.193077
C  0.632304 1.434702 0.378858
C  1.073167 -0.819346 0.533792
C  -0.358408 0.795569 -0.660298
C  -0.064189 -0.732744 -0.554378
C  0.677635 0.342191 1.49278
C  2.060357 1.313987 -0.222442
C  2.308269 -0.212358 -0.169145
C  -1.8195 0.95833 -0.250201
C  -1.36561 -1.365323 -0.057235
H  0.343609 2.44836 0.691275
H  1.229062 -1.827214 0.940127
H  -0.218895 1.22771 -1.664961
H  0.233673 -1.223293 -1.495918
H  -0.285159 0.182817 2.00755
H  1.448188 0.546931 2.25482
H  2.807311 1.830351 0.41002
H  2.172665 1.703479 -1.249103
