program: Gaussian 09
title: 000274436
version: EM64L-G09RevD.01
frameworkgroup: C1[X(C8H11NO4)]
method: RPBEPBE
basis: SDD
operation: Freq
keyword: #p
keyword: freq=noraman
keyword: PBEPBE/SDD
title: #p freq=noraman PBEPBE/SDD
converged: YES YES NO NO
title: Mulliken charges:
elementType: O O O O N C C C C C C C C H H H H H H H H H H H
charge: -0.246793 -0.152024 -0.227686 -0.218842 -0.112980 -0.316069 -0.474746 -0.377648 0.172753 0.098830 -0.611978 0.199726 -0.500680 0.316658 0.240623 0.257716 0.249275 0.231010 0.270476 0.229668 0.231780 0.244904 0.254096 0.241929
chargesum: 0.00000
title: Mulliken charges with hydrogens summed into heavy atoms:
elementType: O O O O N C C C C C C C C
charge: -0.246793 -0.152024 -0.227686 -0.218842 -0.112980 0.000589 0.023593 0.102637 0.172753 0.098830 0.119945 0.199726 0.240249
polarizability: 1.26571709e+02 6.24306479e+00 9.55859169e+01 3.47821878e+00 2.87015245e+00 8.76398602e+01
1716.lowfreq: -12.7231 0.0008 0.0009 0.0010 2.2812 6.6803 26.1661 48.1787 52.8830
frequency: 26.1035 48.0429 52.8765 93.0263 105.2255 132.0937 151.0027 163.3200 166.6828 219.9024 262.5382 276.0690 295.0830 318.4670 395.6011 447.1217 544.3679 578.1521 632.1150 654.5593 710.1438 742.9027 775.6922 828.4286 856.5671 907.9071 940.6691 965.4239 1021.4328 1065.9357 1086.8999 1090.4847 1111.6577 1118.9885 1150.3915 1185.8396 1189.6214 1212.5375 1223.8740 1260.6472 1273.3456 1312.5729 1329.0901 1394.4702 1419.8152 1424.5205 1454.2225 1458.1563 1459.0071 1477.1933 1481.1155 1503.0342 1610.6732 1620.8205 1649.4164 2969.7563 2980.6339 3009.4225 3028.8680 3040.6127 3048.8791 3059.1873 3103.3384 3104.9677 3114.3044 3161.0515
redmass: 5.0883 4.7756 5.4846 3.1973 1.2296 2.7822 1.2083 4.3229 3.2272 3.1980 4.8128 3.1213 3.5568 5.4444 10.2502 4.8647 6.3959 5.1304 7.1090 7.1674 3.6447 3.6484 5.1340 4.4609 3.3560 2.6392 2.7484 3.4549 4.7024 1.7518 1.8446 2.6922 1.2669 1.2994 1.4362 1.3754 1.2622 3.8368 1.4158 3.6579 1.5631 1.7065 1.5561 2.2559 1.1924 1.2044 1.0492 1.0920 1.0509 1.0446 1.0840 1.1384 9.9646 10.2174 9.0092 1.0361 1.0586 1.0294 1.0819 1.0839 1.1015 1.0841 1.0987 1.1046 1.1050 1.1050
irintensity: 5.7138 2.1561 3.9707 1.0045 0.4911 2.8901 0.2317 1.7297 2.4179 5.3425 6.6960 2.5467 22.4570 14.0934 7.6939 5.6873 1.0608 15.1923 11.2988 13.7847 3.0616 11.0878 4.8891 31.0801 7.3457 9.3942 5.5281 32.1248 152.9411 7.7050 91.6037 68.3888 0.0286 1.5091 11.8930 61.0956 2.8879 110.5580 23.7534 33.9646 67.5686 16.5020 4.9616 44.3373 12.2514 43.6180 16.6827 15.9501 11.4317 18.6101 4.0258 8.1320 145.5622 205.1676 246.9062 47.4391 70.3821 23.1630 9.1862 50.0128 30.1734 0.9501 3.1631 9.8446 20.0168 12.1578
temp: 298.150 k
press: 1.00000 atm
elementType: 8 8 8 8 7 6 6 6 6 6 6 6 6 1 1 1 1 1 1 1 1 1 1 1
symmnumber: 1
zpe: 487459.5 jmol-1
zpe.correction: 0.185664 hartree
zpe.thermalcorrener: 0.199493 hartree
zpe.thermalcorrenthalpy: 0.200437 hartree
zpe.thermalcorrgfe: 0.143437 hartree
zpe.sumelectzpe: -666.097028 hartree
zpe.sumelectthermal: -666.083198 hartree
zpe.sumelectthermalent: -666.082254 hartree
zpe.sumelectthermalfe: -666.139255 hartree
dipole: -2.3739 -0.7057 -0.6999
dipole: 2.5736
quadrupole: -52.5910 -78.8938 -81.8476
quadrupole: 5.3016 -1.7584 -7.4180
quadrupole: 18.5198 -7.7830 -10.7368 5.3016 -1.7584 -7.4180
hfenergy: -666.2826915 hartree
pointgroup: C01 [X(C8H11N1O4)]
dipole: -0.8425084 -0.347667 -0.4410868 debye
dipolederiv: -0.6043314 -0.0630295 -0.1481859 -0.1289215 -0.9073016 -0.4551868 -0.2254992 -0.2634702 -0.5791581 -0.5619986 -0.0501995 0.0466461 -0.0940923 -0.3577011 -0.1548913 0.3442133 -0.2525968 -0.712141 -0.8364797 -0.4551538 0.1107673 -0.6229135 -0.7964144 0.2060323 0.1602775 0.2615457 -0.5056766 -0.540043 -0.0482432 -0.1996235 -0.2447047 -0.4732718 0.0574773 0.1027037 0.3649049 -0.7177682 -1.0445091 -0.0879982 -0.3100249 0.1095829 -0.5526623 -0.115029 -0.3098645 -0.1177186 -0.4764097 -0.764842 0.2377791 0.2280671 0.2362079 -0.2554834 -0.1238918 0.1950676 -0.0870762 -0.1056524 0.0284036 0.0398965 -0.0587776 -0.0157641 0.0630754 -0.0418706 0.0053843 0.0049709 0.0824697 0.1826644 0.1010784 -0.0750823 0.2027565 0.3886912 0.1607239 -0.0314714 0.1115921 0.3384165 1.3578038 0.0545461 0.4725945 -0.2147496 1.0002678 0.619256 0.6308595 0.41568 0.6053983 1.0922985 0.0997345 -0.2027789 0.3994543 0.2337895 0.1810988 -0.5523305 0.3431775 0.7598736 0.398093 -0.119715 0.0173154 -0.2804206 0.1699056 -0.1560647 -0.0584295 -0.1243488 0.1949421 0.7235452 0.2759229 -0.0065367 0.5832903 0.7981577 -0.348713 -0.2994138 -0.7167043 0.8660378 0.4931421 0.1747339 -0.0111721 0.1842609 0.4096236 0.0034612 0.0637439 0.0565176 0.2092223 0.1115169 -0.0046159 -0.0575318 -0.0319156 0.0966153 0.0097645 -0.0483736 0.0102501 0.0290204 0.0065814 -0.0685262 0.0398434 -0.0510104 0.0057088 0.0742941 0.0257928 0.1163919 -0.0285542 0.0625956 0.0936225 0.0474293 0.051414 0.0111953 -0.0331965 0.0166645 -0.1091311 0.0281541 0.0781966 0.0103889 0.0497342 -0.0224479 0.0039936 0.0282189 -0.0302934 -0.034124 -0.1605592 -0.1590893 -0.1210628 -0.0155944 -0.0770017 0.0099492 -0.0275277 0.0319008 -0.001843 0.066895 0.1440752 -0.066119 -0.040237 0.0308105 -0.0020205 -0.0364449 0.019542 -0.0961646 0.0838604 -0.1814965 -0.0034248 0.0363131 -0.0731922 0.0497967 0.0619601 0.0580051 0.0445079 0.0778906 0.0181046 0.0367101 0.010779 0.0759524 0.0822124 0.0345078 -0.0701392 0.0961971 -0.1486918 -0.0712296 0.0108475 -0.0283968 0.0825049 -0.0287442 0.0289738 -0.0883637 -0.0072768 0.0909434 0.0054678 0.0119586 0.0769918 -0.0169429 0.0330993 -0.0473515 0.0094946 -0.1199239 -0.0070866 0.0615304 -0.0591309 0.0174609 -0.0821578 0.0175177 0.0743992 0.0505289 0.1046428 0.0085737 unknown
polarizability: 122.3055952|10.0639327|95.9800921|7.6883627|6.7230958|91.5117985 unknown
InChI: InChI=1S/C8H11NO4/c1-9-4-3-5(7(9)11)6(10)8(12)13-2/h5H,3-4H2,1-2H3
charge 0 multiplicity 1
24 atoms
O  -0.808227 1.02862 1.398834
O  1.100675 -1.34853 -1.342361
O  2.750848 0.639894 -0.192085
O  2.41881 -0.525908 1.804622
N  -2.246035 -0.277687 0.053589
C  -0.225753 -1.335074 0.72633
C  -1.162256 -2.403375 0.118094
C  -2.287534 -1.601842 -0.59787
C  -1.104961 -0.039715 0.797167
C  0.993013 -1.019124 -0.136996
C  -3.262395 0.747346 -0.183074
C  2.120779 -0.282676 0.611642
C  3.846733 1.411714 0.453047
H  0.123959 -1.555095 1.749107
H  -1.589267 -3.02237 0.924538
H  -0.630417 -3.057199 -0.591068
H  -2.091403 -1.502659 -1.683638
H  -3.282758 -2.065585 -0.466546
H  -2.982709 1.644824 0.392658
H  -4.258427 0.398579 0.147859
H  -3.317574 1.010805 -1.256939
H  4.6581 0.729736 0.756882
H  3.458651 1.941786 1.338633
H  4.182446 2.114535 -0.320722
