program: Gaussian 09
title: 000274434
version: EM64L-G09RevD.01
frameworkgroup: C1[X(C8H10O2)]
method: RPBEPBE
basis: SDD
operation: Freq
keyword: #pfreq=noraman
keyword: PBEPBE/SDD
title: #p freq=noraman PBEPBE/SDD
converged: NO YES NO NO
title: Mulliken charges:
elementType: O O C C C C C C C C H H H H H H H H H H
charge: -0.202431 -0.391607 -0.309600 -0.261060 -0.495580 -0.454520 -0.459946 0.361463 -0.020557 -0.326616 0.225408 0.263700 0.254696 0.224753 0.230496 0.233606 0.237963 0.241456 0.285976 0.362401
chargesum: 0.00000
title: Mulliken charges with hydrogens summed into heavy atoms:
elementType: O O C C C C C C C C
charge: -0.202431 -0.029206 -0.084193 0.002640 -0.016131 0.009582 0.019473 0.361463 -0.020557 -0.040641
polarizability: 1.07924389e+02 3.57505463e+00 8.96233289e+01 2.03938747e+00 -2.15975185e+00 6.48373845e+01
1716.lowfreq: 0.0007 0.0009 0.0010 10.8637 15.1733 19.3030 90.4192 152.4753 170.7949
frequency: 90.4139 152.4656 170.7947 238.4686 259.9312 332.4644 413.7620 477.4057 519.3827 544.1608 590.1203 674.4824 690.2376 783.2628 799.8213 818.1501 873.9561 882.2806 905.5646 910.7433 924.7145 957.8915 981.1489 1035.9723 1042.9274 1075.7235 1104.2476 1125.6951 1146.7572 1169.8947 1210.7534 1218.5535 1256.9703 1270.6158 1271.7260 1278.6085 1299.3856 1308.6413 1356.1326 1465.3272 1471.9241 1488.7729 1613.6654 1675.6903 3004.1599 3013.6040 3018.4957 3036.6351 3066.7309 3086.7453 3092.2627 3109.5131 3179.2529 3539.3751
redmass: 4.2696 4.6791 5.6186 1.9828 2.0243 7.0436 2.0864 2.0080 3.3873 3.8263 2.7520 5.1070 4.0030 4.0251 2.8521 1.5538 2.6246 2.2721 2.7944 1.4602 2.7035 2.0956 1.7412 1.8619 1.6443 1.6483 1.4667 1.3091 1.7937 1.4351 1.2475 2.4102 1.4698 1.4188 1.7302 1.6154 1.5715 1.5318 1.3250 1.0808 1.0870 1.1010 10.6069 8.7043 1.0607 1.0620 1.0634 1.0850 1.1044 1.1054 1.1064 1.0911 1.0936 1.0652
irintensity: 0.4742 1.2013 1.0230 0.3459 4.4517 2.9385 2.2904 35.4353 27.3457 3.3162 56.7164 9.1847 5.2801 26.2591 11.8131 29.2575 1.0784 4.8224 42.9959 33.5561 9.8920 26.0649 12.7498 23.3893 2.9443 230.2397 35.9437 13.6311 2.9396 0.6787 0.1981 15.1875 2.4049 0.7522 2.0099 3.5584 4.8397 0.3678 6.6917 5.4911 11.7123 9.6055 353.7130 183.6050 18.6415 32.3474 60.2412 53.0057 1.7606 24.6351 47.3893 22.4473 0.3414 29.8595
temp: 298.150 k
press: 1.00000 atm
elementType: 8 8 6 6 6 6 6 6 6 6 1 1 1 1 1 1 1 1 1 1
symmnumber: 1
zpe: 430813.4 jmol-1
zpe.correction: 0.164088 hartree
zpe.thermalcorrener: 0.172526 hartree
zpe.thermalcorrenthalpy: 0.173470 hartree
zpe.thermalcorrgfe: 0.130849 hartree
zpe.sumelectzpe: -460.516045 hartree
zpe.sumelectthermal: -460.507608 hartree
zpe.sumelectthermalent: -460.506663 hartree
zpe.sumelectthermalfe: -460.549284 hartree
dipole: 1.0811 -4.6451 0.7380
dipole: 4.8260
quadrupole: -60.2197 -64.5776 -58.5953
quadrupole: 0.6441 -0.3609 0.2570
quadrupole: 0.9111 -3.4467 2.5356 0.6441 -0.3609 0.2570
hfenergy: -460.6801334 hartree
pointgroup: C01 [X(C8H10O2)]
dipole: -0.4345185 1.8253732 0.2901432 debye
dipolederiv: -0.4755086 0.1059348 0.029075 -0.2145387 -1.1396202 -0.0701296 -0.0277924 -0.1900166 -0.3120439 -1.0570011 -0.3912571 0.0125752 -0.9457302 -0.5698951 0.0975269 -0.0367762 0.0434889 -0.3888103 0.020912 0.0288322 0.0600527 -0.0092845 0.1091315 0.0347701 0.0358136 0.0647734 0.1020307 -0.1260001 0.224526 0.0178216 0.2477895 -0.1199283 -0.043602 -0.0258016 -0.0155521 0.0289988 -0.0032621 -0.0545056 0.0103882 -0.0274248 0.0540953 -0.0185547 -0.0223604 -0.0141724 0.0429024 -0.0020353 -0.0633999 -0.043381 -0.0045838 0.0657991 0.013672 -0.019373 -0.0041728 0.05136 0.0551351 -0.0034935 -0.0231017 -0.0439498 0.0659681 0.0290634 0.0606976 -0.0057767 0.0670571 -1.0482381 -0.485698 0.0380062 -0.3832709 -0.2162701 0.0162103 0.1136665 0.0501664 -0.163199 1.1828454 -0.017969 -0.103124 0.4269885 1.2649117 0.1004486 -0.0378339 0.2265917 0.0704056 1.339583 0.4350138 -0.1193422 0.629189 0.4483635 0.0001735 -0.1423558 -0.0007663 0.0001761 -0.0725624 -0.1279716 -0.0671604 -0.0867692 -0.0831094 -0.0616171 -0.0356129 -0.0541131 0.036351 -0.0423526 -0.0854829 0.0383015 -0.1021361 -0.0229708 0.0407357 0.0430083 0.0268836 0.0530124 0.063534 0.0174617 -0.0886081 0.009846 0.0491722 0.0893725 -0.061102 0.0512538 -0.1154965 -0.0742875 0.1103803 0.0706339 0.1332645 -0.0413725 -0.0692212 0.0440516 -0.0255705 0.0680861 0.0038647 -0.0468237 0.1036604 -0.0137468 0.0587407 0.0063363 0.0866581 0.0402173 -0.0991055 -0.0183381 0.1142691 -0.0042628 0.0887358 -0.1562481 0.0041682 -0.0130496 -0.0311328 0.0678596 -0.1545826 0.0553037 -0.0169671 0.122562 0.0169315 0.0086204 -0.0006654 0.0084576 0.0695334 0.0751443 0.0003745 0.0115882 -0.0419431 0.0129035 -0.0926157 -0.0256792 -0.0782258 -0.1020179 0.0577008 0.0250499 0.0255269 0.0099549 0.0225418 -0.0285829 0.019669 -0.0311743 0.181505 0.2754491 0.1594553 0.0483176 0.2050478 0.1808556 -0.0567747 0.0448377 -0.0611594 0.341395 unknown
polarizability: 107.7178141|3.7792812|89.7167653|-3.2145819|1.8817126|64.9505235 unknown
InChI: InChI=1S/C8H10O2/c9-4-7-5-1-2-6(3-5)8(7)10/h4-6,9H,1-3H2
charge 0 multiplicity 1
20 atoms
O  -0.099403 -2.417779 -0.22229
O  3.068801 0.68304 -0.182515
C  -0.005315 1.173094 0.430527
C  -1.594548 -0.481605 0.37954
C  -1.109643 0.605718 1.383536
C  -0.863065 1.550086 -0.83065
C  -1.935769 0.397631 -0.880038
C  0.757777 -0.10861 0.095265
C  -0.264712 -1.196524 0.053124
C  2.08115 -0.29771 -0.168336
H  0.592107 2.00747 0.838737
H  -2.394435 -1.166913 0.692712
H  -0.70423 0.189807 2.321632
H  -1.892294 1.351154 1.613475
H  -0.2518 1.597198 -1.747897
H  -1.342088 2.535722 -0.687347
H  -2.960529 0.798873 -0.785588
H  -1.887982 -0.188649 -1.813231
H  2.496903 -1.283244 -0.394915
H  2.690876 1.576142 0.02826
