program: Gaussian 09
title: 000274432
version: EM64L-G09RevD.01
frameworkgroup: C1[X(C7H14O3)]
method: RPBEPBE
basis: SDD
operation: Freq
keyword: #pfreq=noraman
keyword: PBEPBE/SDD
title: #p freq=noraman PBEPBE/SDD
converged: YES YES NO NO
title: Mulliken charges:
elementType: O O O C C C C C C C H H H H H H H H H H H H H H
charge: -0.331391 -0.448219 -0.223452 0.120574 -0.346659 -0.679361 -0.708180 0.250199 -0.255994 -0.658722 0.213860 0.189503 0.216988 0.220620 0.240930 0.212840 0.242395 0.218682 0.240676 0.222078 0.364310 0.220503 0.227666 0.250154
chargesum: 0.00000
title: Mulliken charges with hydrogens summed into heavy atoms:
elementType: O O O C C C C C C C
charge: -0.331391 -0.083909 -0.223452 0.120574 0.056704 -0.000822 -0.034263 0.250199 0.206759 0.039601
polarizability: 9.95054679e+01 3.26006965e+00 8.44051107e+01 -6.00060170e-01 1.85088574e+00 7.30104611e+01
1716.lowfreq: -13.3221 -0.0005 -0.0003 0.0005 4.3087 13.2034 31.6712 64.2737 85.7143
frequency: 30.2404 64.2279 85.6228 143.0873 163.7932 183.4224 205.0494 220.1161 232.3227 277.3580 307.0937 317.6903 337.0936 373.1160 434.9225 529.5648 535.4710 596.5609 718.4461 735.5513 803.5177 818.4770 865.7388 892.6579 946.5026 983.5341 997.0930 1010.7450 1024.0195 1072.6167 1098.7379 1145.5679 1153.6210 1177.4812 1212.8968 1272.4589 1280.8828 1331.1667 1356.5510 1376.4026 1388.5766 1393.8082 1401.4722 1457.2056 1457.2991 1463.0900 1463.6864 1467.1808 1475.2315 1483.6336 1485.0633 1639.9895 2938.8956 2987.1380 2989.5593 2994.3579 3033.9334 3059.4481 3081.4664 3083.8876 3089.3398 3095.3511 3102.9410 3106.9322 3121.0432 3475.0470
redmass: 4.3353 3.2394 3.5481 1.7867 1.7100 1.5781 1.7067 1.1748 1.7102 3.0057 2.8276 2.8329 2.9203 3.9925 3.3239 3.1095 1.4219 2.1527 6.7462 3.0648 2.1991 1.7478 2.5984 1.8388 1.3891 1.5676 2.5295 2.6880 1.9257 4.2807 2.2036 1.3965 1.6546 2.8928 2.8072 1.8422 1.1324 1.3050 1.2804 1.1914 1.1853 1.2309 1.1930 1.0601 1.0910 1.0505 1.0438 1.0678 1.0554 1.0536 1.0599 9.5291 1.0686 1.0351 1.0362 1.0362 1.0590 1.0947 1.1005 1.0997 1.0975 1.1035 1.0994 1.0995 1.1066 1.0645
irintensity: 2.6460 1.7181 0.0443 3.2054 0.4176 2.3718 2.8377 0.1117 0.2494 2.7795 1.5516 9.6880 6.5011 6.1464 1.7416 5.5285 101.0595 75.4980 5.4637 12.7001 9.8458 4.8147 4.0606 9.2298 3.9478 0.4603 33.4846 54.1490 38.7775 370.2065 8.1806 30.2228 6.0141 19.1504 1.5272 7.1686 1.4268 14.4477 1.1115 14.9691 23.7875 25.3830 57.4967 1.4428 13.6036 3.9545 10.5249 6.7100 20.9189 26.1489 13.5289 153.0209 71.6541 22.8593 25.2524 15.9830 28.9850 26.1505 16.3931 41.6631 31.7268 1.8624 23.1073 16.7865 27.9101 68.6756
temp: 298.150 k
press: 1.00000 atm
elementType: 8 8 8 6 6 6 6 6 6 6 1 1 1 1 1 1 1 1 1 1 1 1 1 1
symmnumber: 1
zpe: 532619.3 jmol-1
zpe.correction: 0.202864 hartree
zpe.thermalcorrener: 0.215324 hartree
zpe.thermalcorrenthalpy: 0.216268 hartree
zpe.thermalcorrgfe: 0.164254 hartree
zpe.sumelectzpe: -499.987135 hartree
zpe.sumelectthermal: -499.974676 hartree
zpe.sumelectthermalent: -499.973731 hartree
zpe.sumelectthermalfe: -500.025745 hartree
dipole: 1.5718 -0.4310 0.1331
dipole: 1.6352
quadrupole: -52.2954 -73.8276 -60.1654
quadrupole: 7.7857 -0.2791 -2.2825
quadrupole: 9.8007 -11.7315 1.9307 7.7857 -0.2791 -2.2825
hfenergy: -500.189999 hartree
pointgroup: C01 [X(C7H14O3)]
dipole: -0.5618029 0.1394289 0.2807515 debye
dipolederiv: -1.2698749 -0.3689772 0.2782145 -0.3948031 -0.8569816 0.068091 0.2142419 0.0191176 -0.3956036 -0.387873 -0.1856655 0.0028894 -0.1291984 -0.8020357 -0.044021 0.0089937 -0.0407738 -0.6001721 -0.6392144 0.2477904 0.0492425 -0.0604881 -0.9249454 0.0676605 0.0524142 0.005326 -0.2670988 -0.1202753 0.0677019 -0.0008172 0.0574818 -0.1238266 -0.0144199 -0.0622857 -0.052211 0.0203241 0.2660135 0.1220793 -0.0225691 0.0485106 0.5878816 -0.0476677 -0.0538147 -0.0017611 0.429424 -0.0196996 -0.0035132 -0.0043056 -0.0239879 0.0194015 0.0278459 0.0886572 0.0278075 -0.024869 0.023595 -0.0250597 0.0235365 0.0024616 -0.0547613 0.0029952 0.0070736 -0.0258685 0.0273559 1.2943251 0.0445251 -0.137815 0.4657835 1.3954688 -0.1803432 -0.1372513 -0.0560469 0.1124804 0.8068268 0.139881 -0.1807947 -0.0063466 0.2242662 0.0005293 -0.1483354 0.011868 0.3834826 -0.0816077 -0.0405825 0.0506061 0.0090845 0.0417433 -0.0277966 0.0628845 -0.0461452 -0.1458999 -0.1568009 -0.0054578 0.0720398 0.0261154 0.0434915 -0.0051571 0.0246467 0.0037099 0.0693418 0.0321739 0.0233173 -0.124745 -0.0012371 -0.0475704 0.0955739 -0.0615201 0.0664364 -0.1778157 0.0987324 0.0434027 0.0203744 0.019783 -0.0395703 -0.1351567 0.0033457 -0.0880605 -0.0349113 -0.1607695 0.0368293 -0.0024515 0.0437989 0.1010734 0.0055338 0.0170733 0.0030673 0.0710392 0.0689216 -0.0861011 0.0417594 -0.0690507 -0.0315686 0.1055172 0.0238509 0.0582154 0.0583329 -0.1670764 0.0072729 0.0275754 0.0649463 0.0739611 0.0069679 0.0083452 0.0135923 0.0933986 0.1162533 0.0327806 0.0244224 -0.0060565 -0.0480524 -0.0809709 0.014796 -0.1108939 0.0129377 0.0717973 0.0168787 -0.0879735 -0.0101425 0.0709364 0.042188 -0.0471098 0.0793845 -0.1263169 -0.0057919 -0.0065283 0.0208056 0.1120431 0.0086022 0.0914631 -0.0104961 0.0662754 -0.0134157 -0.0164194 -0.0582283 0.0102275 -0.0935529 -0.0485716 -0.1012753 -0.0068922 -0.0758103 0.0184845 0.2315449 -0.0068682 0.0100421 -0.0563588 0.3762438 0.0946319 -0.0064543 0.100364 0.3500501 -0.1687838 0.0016563 0.0518174 0.0099752 0.1227648 0.0001914 0.0607727 0.0135693 0.0755912 0.0935138 0.0855705 -0.0640156 0.0659864 -0.0444623 0.0987315 -0.0249554 0.0633969 0.0090463 0.0904892 -0.0827043 -0.0580658 -0.0747479 -0.0434885 -0.0711123 -0.0279804 -0.0345592 0.0548138 unknown
polarizability: 96.959342|3.3779702|84.9244343|-7.5701113|-1.3448265|75.0372635 unknown
InChI: InChI=1S/C7H14O3/c1-4-10-6(9)7(2,3)5-8/h8H,4-5H2,1-3H3
charge 0 multiplicity 1
24 atoms
O  -1.167641 -0.566323 -0.353342
O  0.864628 -2.182282 -1.207073
O  -0.913826 1.746373 -0.406137
C  1.101506 0.289912 -0.633729
C  1.313911 -0.871784 -1.661177
C  1.663954 -0.118855 0.759778
C  1.819669 1.556093 -1.15903
C  -0.394549 0.611361 -0.464926
C  -2.638984 -0.391235 -0.117652
C  -2.930311 -0.234278 1.376141
H  2.399059 -0.981567 -1.833076
H  0.834393 -0.593795 -2.626353
H  1.499029 0.682515 1.502415
H  2.751471 -0.295298 0.673537
H  1.197125 -1.050864 1.118554
H  2.909177 1.37756 -1.201231
H  1.627083 2.418293 -0.499349
H  1.470217 1.828096 -2.171831
H  -2.976722 0.488622 -0.691835
H  -3.079789 -1.310907 -0.534873
H  -0.080983 -2.07166 -0.915236
H  -4.023183 -0.184462 1.537426
H  -2.536076 -1.091377 1.948762
H  -2.483658 0.695164 1.766737
