program: Gaussian 09
title: 000274430
version: EM64L-G09RevD.01
frameworkgroup: C1[X(C7H12O2)]
method: RPBEPBE
basis: SDD
operation: Freq
keyword: #pfreq=noraman
keyword: PBEPBE/SDD
title: #p freq=noraman PBEPBE/SDD
converged: YES YES NO NO
title: Mulliken charges:
elementType: O O C C C C C C C H H H H H H H H H H H H
charge: -0.212523 -0.447312 0.252022 -0.475818 -0.446589 -0.495365 0.090832 -0.405903 -0.746527 0.221054 0.243871 0.213030 0.230079 0.254504 0.247158 0.219408 0.208143 0.228979 0.224633 0.237527 0.358798
chargesum: 0.00000
title: Mulliken charges with hydrogens summed into heavy atoms:
elementType: O O C C C C C C C
charge: -0.212523 -0.088515 0.252022 -0.010892 -0.003480 0.006297 0.090832 0.021648 -0.055389
polarizability: 8.02876303e+01 2.81713993e-01 7.90175855e+01 3.96102747e+00 8.29845590e-02 7.02802345e+01
1716.lowfreq: -17.4416 -8.0679 -0.0008 -0.0007 -0.0005 17.0529 64.5540 94.6540 169.2345
frequency: 64.4587 94.6051 169.1864 196.0463 199.9243 246.5562 273.5993 331.1226 437.3029 455.7581 483.0288 543.0156 593.6763 610.1884 671.0663 796.2249 822.5596 886.0338 916.0544 933.3321 956.8894 982.1616 996.3226 1027.7050 1049.1519 1066.7173 1137.3776 1162.0011 1187.4817 1220.3503 1230.8403 1252.6358 1274.4244 1309.2161 1317.2065 1344.3111 1361.5204 1385.0972 1421.8077 1452.6693 1464.6689 1474.0526 1477.7080 1489.7577 1637.8867 2975.3382 2978.3512 2993.6714 2999.1139 3011.6492 3060.6708 3064.8561 3066.7491 3072.5748 3080.7324 3084.5572 3546.3918
redmass: 3.6684 2.9908 4.3479 2.0539 1.1486 2.3036 2.6012 2.2512 3.7226 1.5790 1.7295 2.3548 2.9333 4.4163 3.3933 1.8798 1.8358 1.9619 1.9720 1.9599 1.4039 2.5027 2.4476 2.0096 1.8499 2.2906 1.4718 1.5223 1.9379 1.8237 1.9419 1.7905 1.4755 1.3255 1.5504 1.2293 1.1937 1.2065 1.0775 1.0792 1.0697 1.0797 1.0549 1.0833 11.3638 1.0477 1.0502 1.0635 1.0604 1.0654 1.0959 1.1020 1.1010 1.0990 1.1022 1.1018 1.0658
irintensity: 9.3602 4.0226 1.2873 0.3505 0.2573 0.1905 11.1632 1.4872 1.6096 69.7049 124.7419 3.3560 5.0740 8.3250 1.3700 9.4838 2.6507 10.6293 11.8753 26.3073 10.6744 9.1087 70.6142 19.5100 4.1681 24.3865 27.5777 11.8115 13.0747 8.8243 10.9400 16.2051 2.9041 1.3961 0.9957 17.1946 7.0298 27.8979 20.8308 3.3777 7.4019 11.4045 9.5998 15.0862 147.4650 11.2497 68.6567 13.7141 21.1615 29.9764 8.3064 15.6684 8.9899 37.5075 46.2740 28.5358 9.1317
temp: 298.150 k
press: 1.00000 atm
elementType: 8 8 6 6 6 6 6 6 6 1 1 1 1 1 1 1 1 1 1 1 1
symmnumber: 1
zpe: 468567.4 jmol-1
zpe.correction: 0.178468 hartree
zpe.thermalcorrener: 0.188043 hartree
zpe.thermalcorrenthalpy: 0.188987 hartree
zpe.thermalcorrgfe: 0.144128 hartree
zpe.sumelectzpe: -423.659829 hartree
zpe.sumelectthermal: -423.650254 hartree
zpe.sumelectthermalent: -423.649310 hartree
zpe.sumelectthermalfe: -423.694169 hartree
dipole: -2.4219 -1.9703 0.5042
dipole: 3.1626
quadrupole: -55.4164 -56.0347 -58.1187
quadrupole: -1.8354 3.5200 -4.0414
quadrupole: 1.1069 0.4885 -1.5954 -1.8354 3.5200 -4.0414
hfenergy: -423.838297 hartree
pointgroup: C01 [X(C7H12O2)]
dipole: 0.8316496 -0.7014579 -0.6037509 debye
dipolederiv: -0.6048231 0.1997555 -0.0469627 0.1971809 -0.9186399 -0.0775966 -0.0212905 -0.0640955 -0.353852 -0.7023802 0.1106195 0.1088649 0.1253874 -0.2248515 -0.1582725 0.1759834 -0.1229693 -0.7146687 -0.2160206 -0.1084308 -0.0599169 -0.1125258 -0.1864042 -0.1367098 -0.0936119 -0.204649 -0.1170793 -0.0120238 -0.0252382 -0.0143044 -0.0029704 0.0805977 0.0750889 -0.0006552 -0.0174009 0.0605989 0.0199545 -0.0245617 -0.0005754 -0.0119298 0.0492439 -0.0216459 -0.0536988 0.0053619 0.1561154 -0.3836439 0.0939467 -0.2181286 -0.0056795 -0.0210156 -0.0469767 -0.2506772 0.0460253 0.0122564 0.8645203 -0.0842054 0.356061 -0.0943049 0.9712727 0.2322511 0.3168321 0.1758222 0.2496338 0.4624852 -0.0064522 -0.104881 -0.0657995 0.2487978 0.0987707 -0.1258736 0.1012071 0.5212307 0.019023 -0.017728 0.0182019 -0.0039536 0.0126921 -0.0249652 0.046378 0.0644722 0.0484419 0.041472 -0.0299913 -0.0221435 -0.0282742 -0.1202352 -0.0859014 -0.019685 -0.1315982 0.0283819 0.0387054 -0.0309658 0.0447727 -0.0146892 0.0812528 0.0202127 0.0466095 0.0680476 -0.0971856 0.0192332 0.0031269 0.0842606 -0.0099404 0.0357315 -0.0249327 0.1390161 -0.0524407 -0.1092915 -0.0329654 0.0765259 -0.0862781 0.0761813 0.0081957 0.0637678 -0.1241636 0.0921999 -0.0235245 0.0049859 -0.0707072 0.0280254 -0.0611123 -0.026253 0.0423971 0.0818981 0.0473831 0.0897309 0.0891684 0.0304021 0.0346667 0.0492135 0.0626626 -0.0190781 -0.003043 -0.0632089 -0.0637718 0.0284133 -0.066584 -0.0095236 -0.091787 -0.0890288 -0.0664577 0.0142255 -0.0309196 0.0416129 -0.0192223 0.0599369 -0.0448688 0.1245307 -0.0162877 0.1012903 -0.0629602 0.0573235 -0.1127841 -0.1326128 0.0213122 0.1035128 0.0168392 0.0917985 -0.0148675 0.0569789 -0.0062221 0.0597787 0.0385523 -0.096039 -0.0657225 -0.0985727 -0.0553465 -0.0828615 -0.0414802 -0.0630642 0.0158822 0.0548058 0.0752111 -0.0641647 0.0803572 -0.0527378 0.1064553 -0.030246 0.0480184 0.0243748 0.4223726 -0.109933 -0.0408958 -0.0681507 0.0685548 0.0200317 -0.0505363 0.0507072 0.2841191 unknown
polarizability: 79.8676532|-2.5248704|77.562677|3.4622872|3.3799911|72.15512 unknown
InChI: InChI=1S/C7H12O2/c1-7(5-8)4-2-3-6(7)9/h8H,2-5H2,1H3
charge 0 multiplicity 1
21 atoms
O  -0.231571 2.015238 0.184903
O  -2.173317 -0.042457 1.358106
C  -0.428518 -0.388468 -0.416098
C  0.365448 -1.540458 0.257995
C  1.830635 -1.019358 0.351518
C  1.676747 0.492962 0.656354
C  0.286192 0.869316 0.130783
C  -1.935983 -0.356014 -0.055694
C  -0.277483 -0.413868 -1.965225
H  0.286195 -2.486471 -0.30642
H  -0.043539 -1.708801 1.272769
H  2.35618 -1.167037 -0.609969
H  2.41136 -1.547908 1.126202
H  2.456087 1.141343 0.217786
H  1.680317 0.689687 1.747214
H  -2.375167 -1.357681 -0.206334
H  -2.45971 0.369027 -0.712048
H  0.778765 -0.505231 -2.275164
H  -0.826282 -1.281541 -2.377526
H  -0.690153 0.506136 -2.417393
H  -1.987702 0.923683 1.485641
