program: Gaussian 09
title: 000274420
version: EM64L-G09RevD.01
frameworkgroup: C1[X(C7H8O4)]
method: RPBEPBE
basis: SDD
operation: Freq
keyword: #p
keyword: freq=noraman
keyword: PBEPBE/SDD
title: #p freq=noraman PBEPBE/SDD
converged: YES YES NO NO
title: Mulliken charges:
elementType: O O O O C C C C C C C H H H H H H H H
charge: -0.414678 -0.416379 -0.214281 -0.212129 0.176305 -0.522443 -0.528794 -0.204127 -0.204528 0.144539 0.149028 0.232046 0.268737 0.237280 0.268326 0.236282 0.236337 0.384391 0.384091
chargesum: 0.00000
title: Mulliken charges with hydrogens summed into heavy atoms:
elementType: O O O O C C C C C C C
charge: -0.030287 -0.032288 -0.214281 -0.212129 0.176305 -0.021660 -0.023188 0.032154 0.031808 0.144539 0.149028
polarizability: 8.61998788e+01 -3.73667803e-01 7.57310070e+01 2.94464483e-01 -5.40881628e+00 8.29202407e+01
1716.lowfreq: -11.8012 -4.9355 -0.0006 0.0006 0.0008 11.8183 19.7367 50.4256 73.9405
frequency: 16.2396 50.4084 73.9096 148.8867 208.1388 217.6536 304.4439 354.6809 372.4267 421.6218 432.9166 571.0064 575.0247 591.9061 630.3857 673.1660 688.8128 718.2931 754.6430 785.7409 841.7926 933.5403 955.3295 962.9936 980.4004 1002.0034 1015.9948 1054.4871 1097.3191 1103.3670 1115.7188 1164.5698 1215.1693 1282.2443 1291.4016 1307.0318 1309.5256 1329.1196 1461.3530 1467.1112 1648.8833 1651.0536 1677.9655 2994.3623 2995.8192 3047.2896 3048.9421 3148.2495 3181.7212 3522.3975 3524.6149
redmass: 3.8860 7.0545 10.8525 6.2053 3.9241 4.1010 2.9457 2.8454 3.3279 5.6363 6.5482 1.6573 1.4429 2.2319 2.6992 1.2348 4.5118 4.9147 4.8812 6.2506 2.0758 1.2221 2.1567 1.8069 4.9774 3.1269 3.1962 2.0431 3.3811 1.4578 1.6409 1.0869 1.3163 1.5155 2.4981 1.8934 1.6471 1.7970 1.0848 1.0900 6.2446 9.4324 9.3294 1.0606 1.0614 1.1008 1.1012 1.0860 1.1074 1.0642 1.0642
irintensity: 0.2360 0.8562 0.6917 0.0561 1.5105 1.2876 10.0374 2.8097 12.2206 3.2770 1.8141 66.0837 40.6596 86.6235 126.6158 113.2400 18.9075 6.4861 1.4490 2.1271 0.0656 2.2686 82.2690 5.4071 48.4834 43.7198 90.0324 26.6068 75.7672 70.5803 137.6667 3.7285 11.9730 13.4666 56.6958 6.6227 5.1958 5.5619 18.4578 9.3921 26.5571 440.5671 11.4431 38.5261 0.9544 5.8197 7.7967 3.9123 24.4592 31.9248 32.4849
temp: 298.150 k
press: 1.00000 atm
elementType: 8 8 8 8 6 6 6 6 6 6 6 1 1 1 1 1 1 1 1
symmnumber: 1
zpe: 370376.3 jmol-1
zpe.correction: 0.141069 hartree
zpe.thermalcorrener: 0.151537 hartree
zpe.thermalcorrenthalpy: 0.152481 hartree
zpe.thermalcorrgfe: 0.103304 hartree
zpe.sumelectzpe: -571.605841 hartree
zpe.sumelectthermal: -571.595373 hartree
zpe.sumelectthermalent: -571.594429 hartree
zpe.sumelectthermalfe: -571.643605 hartree
dipole: 0.5319 0.0599 0.0582
dipole: 0.5384
quadrupole: -53.6070 -69.7338 -62.0369
quadrupole: 0.9557 -0.6792 9.5368
quadrupole: 8.1856 -7.9412 -0.2443 0.9557 -0.6792 9.5368
hfenergy: -571.7469095 hartree
pointgroup: C01 [X(C7H8O4)]
dipole: -0.1820103 -0.1000727 0.0415477 debye
dipolederiv: -0.9285416 -0.1837037 -0.4054323 -0.1641629 -0.3868904 -0.0471004 -0.4129796 -0.0643318 -0.5962391 -0.5783953 -0.185266 0.2902063 -0.201507 -0.5166029 0.3610309 0.2991972 0.3434737 -0.8064442 -0.6162109 0.2094877 0.1102964 0.0681593 -0.6289491 -0.3748692 -0.0992989 -0.3284162 -0.636989 -0.3507556 -0.03981 0.1582432 0.0481625 -0.7717149 -0.3237668 0.2490316 -0.0962526 -0.7337228 -0.2529246 0.0181755 0.0547602 0.0170709 -0.2970396 -0.0728721 0.1148987 -0.1917497 -0.134493 0.0195803 -0.0408268 -0.0426074 0.0102891 0.1059753 -0.0183924 -0.1154634 -0.0285199 0.0259664 0.0577348 0.0098726 0.0482109 -0.0244462 0.0912644 -0.0086111 0.1036586 0.0545763 -0.0154193 0.1056458 0.1089092 0.0430013 0.085986 -0.201742 -0.0384002 0.1326442 -0.0178329 -0.0068824 0.0476351 0.1114652 -0.0400213 0.1200302 -0.1863509 -0.0454266 -0.1021771 -0.1122964 0.0433282 1.3923944 -0.2478691 0.19037 -0.1776195 0.7263615 0.5534374 0.2956337 0.5698907 0.8813211 0.4420774 0.2437843 -0.4605251 0.2078285 1.3471514 0.079815 -0.541297 -0.0060025 1.1616317 -0.0262985 0.0756822 -0.0836162 0.0866084 -0.0454573 0.0740376 -0.0253987 0.0588299 0.0729907 0.0349021 -0.0023366 -0.0219463 -0.0133045 0.0942782 -0.114533 0.0079113 -0.0569567 0.011237 0.0514732 0.0268779 0.0050101 0.0229173 -0.0611354 0.1336209 -0.0241306 0.0865402 0.0422528 0.0930136 -0.022911 0.0853875 -0.0219383 0.0342822 -0.0671653 0.0188785 -0.0563357 0.0122828 -0.0301013 -0.0878337 0.0780682 -0.0905809 0.1351731 0.0595161 0.0699977 0.0676417 0.0238098 -0.0837556 -0.0809925 -0.0667562 -0.0762805 0.1535364 -0.0010474 -0.0677107 0.0091442 0.0613805 0.2567772 0.0763549 0.0410804 0.1215585 0.2588516 -0.0787571 0.0881204 -0.1007287 0.297357 0.3657496 0.01094 0.0162703 -0.018771 0.1490084 -0.0705162 0.0084842 -0.1306736 0.2966318 unknown
polarizability: 84.4434762|4.230218|75.248752|-1.5692155|2.6931796|85.1588982 unknown
InChI: InChI=1S/C7H8O4/c8-5(9)7(6(10)11)3-1-2-4-7/h1-2,8,10H,3-4H2
charge 0 multiplicity 1
19 atoms
O  -2.201047 0.340075 -0.428264
O  -0.78917 -1.996275 1.062809
O  -1.358236 1.596809 1.330082
O  0.179768 -2.204081 -1.034474
C  0.128466 0.016841 0.103539
C  0.740121 0.620997 -1.221087
C  1.210236 0.243443 1.229399
C  2.152024 1.014212 -0.829634
C  2.409012 0.798309 0.483963
C  -1.182591 0.733762 0.447638
C  -0.143941 -1.4843 -0.069813
H  0.155804 1.48923 -1.581415
H  0.715454 -0.141686 -2.020949
H  1.43718 -0.692012 1.772638
H  0.816414 0.959833 1.975644
H  2.858792 1.42959 -1.55462
H  3.357857 1.008618 0.987099
H  -3.040239 0.827272 -0.207973
H  -0.9565 -2.969336 0.940521
