program: Gaussian 09
title: 000274392
version: EM64L-G09RevD.01
frameworkgroup: C1[X(C8H12O4)]
method: RPBEPBE
basis: SDD
operation: Freq
keyword: #pfreq=noraman
keyword: PBEPBE/SDD
title: #p freq=noraman PBEPBE/SDD
converged: YES YES NO NO
title: Mulliken charges:
elementType: O O O O C C C C C C C C H H H H H H H H H H H H
charge: -0.259616 -0.294442 -0.249793 -0.230687 -0.332286 -0.024831 -0.517107 0.294713 0.288778 -0.256108 -0.758977 -0.664340 0.285911 0.293510 0.262662 0.261034 0.221336 0.237286 0.251545 0.250806 0.248200 0.217743 0.251027 0.223635
chargesum: 0.00000
title: Mulliken charges with hydrogens summed into heavy atoms:
elementType: O O O O C C C C C C C C
charge: -0.259616 -0.294442 -0.249793 -0.230687 -0.046375 0.268679 0.006590 0.294713 0.288778 0.202515 -0.008426 0.028065
polarizability: 1.27622592e+02 2.99273980e+00 8.95549418e+01 1.44013039e+00 -6.18243120e-01 8.24434351e+01
1716.lowfreq: -13.2387 -6.2664 -0.0009 -0.0009 -0.0008 7.2121 19.4410 27.5980 38.3079
frequency: 18.9466 27.0868 38.2898 48.2127 77.6996 89.4056 134.7156 151.8877 212.4614 238.3322 307.0081 311.8276 375.6783 397.7373 431.6997 454.7685 560.1487 595.9720 626.8134 680.8522 738.2995 778.4010 812.1919 826.3981 863.1669 894.3755 937.8602 979.5305 991.5160 1022.1170 1042.1649 1048.9679 1065.5186 1077.6174 1095.8290 1134.2286 1155.3736 1185.0789 1205.5948 1233.8678 1276.5438 1283.0769 1355.9199 1376.1268 1385.9941 1390.0549 1436.7900 1452.7817 1454.7210 1457.8628 1463.0657 1484.7029 1640.4165 1667.0561 2992.0296 3007.3232 3029.9592 3086.7528 3092.7463 3098.1037 3116.7019 3118.4879 3143.2563 3171.4057 3174.5858 3230.5537
redmass: 2.1819 1.6362 3.2120 3.9447 3.3665 4.8501 3.9841 3.2508 1.5544 2.2854 3.5769 3.5911 3.4985 3.0903 3.2393 5.2730 3.1772 4.9363 2.8433 6.3308 2.9255 2.4941 1.3622 4.0140 2.7311 3.5098 1.9643 2.1993 2.2645 3.2292 1.6516 2.1054 1.2725 1.2286 2.1349 1.6255 1.6638 3.1692 2.4803 1.9962 1.2268 1.2224 1.2898 1.6619 1.3257 1.2421 1.3906 1.0550 1.0521 1.0923 1.0449 1.0520 9.6269 9.9442 1.0360 1.0378 1.0594 1.0976 1.1030 1.0954 1.0559 1.1061 1.1017 1.0926 1.0900 1.1161
irintensity: 1.6196 0.2059 0.8997 2.2484 2.2388 0.6569 0.9374 0.6985 3.7342 6.9905 11.0217 11.0040 1.9213 5.6601 5.4464 10.8395 4.0351 3.3484 2.6766 1.9067 8.6170 22.0160 1.5524 10.0783 18.3553 67.6572 67.5416 48.3109 47.8086 172.1961 8.1482 31.1947 11.6180 35.9500 16.2806 66.2738 19.3702 417.5289 36.2417 160.9341 20.5635 2.3540 0.7605 61.8684 20.7701 23.4397 19.4956 24.4525 21.2838 15.6251 15.1162 14.0098 246.0393 193.1708 19.9174 1.7447 27.6423 34.6182 2.1520 7.4064 4.2503 30.1336 8.9367 2.1847 1.2025 2.5199
temp: 298.150 k
press: 1.00000 atm
elementType: 8 8 8 8 6 6 6 6 6 6 6 6 1 1 1 1 1 1 1 1 1 1 1 1
symmnumber: 1
zpe: 497973.5 jmol-1
zpe.correction: 0.189668 hartree
zpe.thermalcorrener: 0.203422 hartree
zpe.thermalcorrenthalpy: 0.204366 hartree
zpe.thermalcorrgfe: 0.145854 hartree
zpe.sumelectzpe: -611.983644 hartree
zpe.sumelectthermal: -611.969890 hartree
zpe.sumelectthermalent: -611.968946 hartree
zpe.sumelectthermalfe: -612.027458 hartree
dipole: 0.5063 1.9677 -1.7003
dipole: 2.6494
quadrupole: -54.8966 -72.7461 -74.9414
quadrupole: 5.1521 8.8651 0.8787
quadrupole: 12.6315 -5.2181 -7.4134 5.1521 8.8651 0.8787
hfenergy: -612.1733119 hartree
pointgroup: C01 [X(C8H12O4)]
dipole: 0.3207763 0.1979179 -0.9718001 debye
dipolederiv: -1.3719879 0.3035367 -0.4246121 0.3398203 -0.5979828 0.2993863 -0.6648566 0.3885559 -0.7151704 -1.0085772 -0.3778625 -0.1306755 -0.6777967 -0.8801909 -0.3327813 -0.2376733 -0.3328509 -0.5471023 -0.7408488 0.0843129 0.3287911 -0.1482867 -0.5125222 -0.1802778 0.2254701 -0.3254963 -0.7588076 -0.5474806 -0.2428494 0.0394287 0.1656478 -0.8108716 0.3364262 -0.2374636 0.2231726 -0.4981393 -0.7675862 -0.0206562 0.2302774 0.0100924 -0.006934 -0.0923859 0.4533693 -0.0239851 -0.1987648 0.9960722 -0.1604253 0.1887688 0.076818 0.093711 0.0739156 -0.1653065 -0.0483788 0.4786231 0.1184224 0.0750537 -0.0948835 -0.1470354 0.0185021 0.1651971 -0.0512688 0.0495416 -0.125444 1.4183424 0.2597747 -0.4096075 0.8589114 0.9294707 0.4549807 -0.1158581 0.6638924 0.9552016 1.3105175 0.123119 0.3759492 -0.4348112 1.1498384 -0.6705521 0.8901594 -0.5774993 0.8429052 0.7912669 0.2480513 0.1087122 0.2474286 0.4474228 0.0526856 0.0072493 -0.0592024 0.2415838 -0.353737 -0.1104069 -0.109797 -0.2045959 -0.0882357 -0.03319 -0.1491887 -0.0165968 -0.0235279 -0.1639548 0.0152653 -0.0698556 0.0329769 -0.0500311 0.0127912 -0.0554165 0.057 0.0313048 0.023571 -0.0557781 0.0272456 -0.0637686 0.0511468 -0.0591885 0.0241265 -0.0644706 0.0333724 -0.017709 0.0361851 -0.047162 -0.0236781 -0.0013614 -0.0245224 0.0024149 0.0229305 0.0965648 0.0313349 -0.0216601 -0.0815816 -0.0284929 0.0808524 -0.0280624 -0.0436174 -0.0041234 0.0070592 0.0513327 -0.0985999 0.034445 -0.0558428 0.0213624 0.0479019 0.0419275 0.0392925 0.0570345 -0.0096187 0.0331132 -0.0030755 -0.0053241 -0.1214676 -0.0496941 0.0015879 -0.0826465 0.0770863 -0.0124271 -0.0409121 -0.0324847 -0.0026467 0.0788705 -0.0146581 0.0341823 0.0849035 -0.0891422 0.0794716 0.0363313 0.0297334 0.0183126 0.0110275 -0.095663 -0.0048829 -0.0916748 0.06046 0.0657349 -0.0296073 0.0345097 -0.0113694 0.1199552 0.0545448 0.0856997 0.0546285 -0.0270878 0.0151337 0.041112 -0.0501114 0.0874903 0.0134254 0.0743224 -0.0608841 0.0677692 0.0862307 -0.1231963 -0.1270046 0.0076542 -0.1197803 0.0361494 0.0333894 0.0157047 0.0266917 0.0976963 0.1253285 0.0135261 -0.0094067 0.0541345 -0.0772169 -0.0491194 0.0065086 -0.0799831 0.0588864 0.0905949 0.0163811 0.0577379 0.0317961 0.0950794 0.0245538 -0.0019837 0.0285299 -0.1408227 unknown
polarizability: 126.4969392|6.0971817|86.7024842|4.9627995|-2.8521045|86.4215451 unknown
InChI: InChI=1S/C8H12O4/c1-3-11-8(10)6-4-7(6)12-5(2)9/h6-7H,3-4H2,1-2H3
charge 0 multiplicity 1
24 atoms
O  2.449596 0.280695 -0.154901
O  -1.680081 -0.84266 -0.392735
O  -2.027978 0.591174 1.425096
O  2.563342 -1.60516 1.225643
C  -0.03196 0.825265 0.045549
C  1.091121 -0.073732 -0.523919
C  0.40225 0.889006 -1.448324
C  -1.329097 0.222384 0.451549
C  3.096186 -0.573997 0.769157
C  -2.961919 -1.544903 -0.077029
C  4.471465 -0.037507 1.090492
C  -4.147508 -0.834573 -0.735706
H  0.286602 1.653175 0.683303
H  0.897965 -1.147418 -0.584921
H  -0.287462 0.475563 -2.186912
H  0.949577 1.786957 -1.746968
H  -2.808319 -2.558551 -0.480647
H  -3.076971 -1.58432 1.020352
H  4.380312 0.83635 1.760825
H  4.982295 0.300097 0.174208
H  5.063375 -0.814274 1.59578
H  -5.072939 -1.414143 -0.560159
H  -4.286666 0.172486 -0.308348
H  -3.998887 -0.745213 -1.825884
