program: Gaussian 09
title: 000274361
version: EM64L-G09RevD.01
frameworkgroup: C1[X(C14H15NO4)]
method: RPBEPBE
basis: SDD
operation: Freq
keyword: #p
keyword: freq=noraman
keyword: PBEPBE/SDD
title: #p freq=noraman PBEPBE/SDD
converged: YES YES NO NO
title: Mulliken charges:
elementType: O O O O N C C C C C C C C C C C C C C H H H H H H H H H H H H H H H
charge: -0.284919 -0.277284 -0.211211 -0.210867 0.025748 -0.214160 -0.152576 -0.109990 -0.116629 -0.469029 -0.475528 -0.482920 -0.079818 0.386785 -0.355835 -0.366228 -0.353855 -0.352073 0.378116 0.265817 0.254137 0.247622 0.243668 0.216163 0.264710 0.230568 0.217502 0.216495 0.236882 0.204104 0.273929 0.280923 0.284758 0.284997
chargesum: 0.00000
title: Mulliken charges with hydrogens summed into heavy atoms:
elementType: O O O O N C C C C C C C C C C C C C C
charge: -0.284919 -0.277284 -0.211211 -0.210867 0.025748 0.051657 0.101562 0.137632 0.127039 0.011843 -0.027459 -0.029544 0.124286 0.386785 -0.081906 -0.085305 -0.069097 -0.067076 0.378116
polarizability: 2.48266454e+02 3.93255188e-01 1.54826873e+02 8.95783154e+00 2.74632726e+00 1.04159951e+02
1716.lowfreq: -20.1471 -0.0011 -0.0010 -0.0006 3.5734 6.5393 21.1425 38.7189 66.0213
frequency: 18.9643 38.6219 66.0183 82.3881 105.9845 178.5754 193.4035 214.9994 219.4291 263.0703 290.2930 349.0408 392.9037 407.9877 412.7528 419.6068 446.2903 493.7942 508.9252 562.3713 580.2810 624.4143 640.6100 664.1996 678.7971 721.9081 740.6939 774.7269 779.3136 799.2399 815.0512 837.2093 853.6616 858.0254 889.3610 895.8533 901.2870 910.7601 927.5086 930.7087 948.2116 970.9660 993.6269 1000.4961 1002.3825 1010.7562 1012.9631 1044.2841 1054.2498 1070.0889 1091.3734 1108.8336 1113.5664 1132.5260 1163.2443 1177.6720 1183.5518 1209.9647 1214.7266 1223.5494 1231.5874 1243.7986 1270.7276 1272.0375 1279.4548 1288.1768 1296.0281 1299.5572 1305.7212 1312.3806 1330.4498 1345.5639 1362.9727 1403.7197 1413.2345 1456.1738 1470.9368 1481.1355 1490.2373 1597.6930 1613.3556 2907.6900 3003.2134 3015.1633 3021.7240 3043.2540 3058.5800 3073.9546 3080.8682 3082.6714 3093.6495 3098.9408 3169.1275 3170.9534 3186.6039 3190.1718
redmass: 4.7705 6.1151 7.1515 5.7256 6.7010 2.9844 6.7498 4.8996 3.0323 6.5375 3.5778 3.6571 4.6217 2.9114 5.0576 2.7413 4.5093 4.8599 6.7224 5.9925 6.1446 7.1104 3.9801 4.8170 4.9303 4.5562 3.4419 2.2657 4.4848 3.7873 2.5454 2.2953 2.5778 1.2468 2.9511 2.5781 2.3912 6.7113 2.6713 2.0682 3.5118 2.0042 1.3732 1.4016 2.4939 2.4227 1.8909 3.2890 2.1961 1.5524 3.3046 1.2778 1.1729 1.3179 1.9386 1.2507 1.5822 1.5934 2.0680 4.7310 1.4818 1.4488 1.4858 1.3918 1.2776 1.2021 1.2875 1.2045 1.5601 1.5481 1.4771 1.6658 7.5023 9.4051 3.9026 1.0826 1.0791 2.5892 1.0919 8.2115 6.3513 1.0813 1.0596 1.0638 1.0629 1.0879 1.1022 1.0894 1.0932 1.1004 1.0955 1.0994 1.0889 1.0889 1.0962 1.0974
irintensity: 0.0535 0.0432 0.0053 0.0396 4.6491 0.7867 0.3774 7.2324 1.5042 0.9037 0.1315 3.8863 3.1568 0.0033 2.5629 1.8149 2.2894 2.1298 0.2222 5.6823 10.5837 0.0411 5.1230 10.9010 19.0562 19.0677 1.4930 1.5720 17.2852 7.7591 26.1529 12.2364 31.9423 1.1162 2.0229 22.6733 12.4315 70.5890 0.9555 5.0727 13.6497 0.1460 4.5852 2.5655 29.1053 9.2219 2.0361 241.5768 3.4177 58.5817 17.2031 11.5294 14.3000 0.7616 2.3951 15.5461 9.4107 42.1044 116.0155 224.5388 7.7083 0.5217 0.7174 1.7305 0.7117 0.4715 0.6581 0.6795 2.4946 14.4373 4.9458 93.6587 83.8733 0.0142 67.4246 12.3351 5.4234 2.3610 14.1084 0.7671 35.9014 56.9611 29.6502 63.7100 26.2215 37.9326 7.4833 11.7482 50.8139 55.1081 12.3136 28.6229 1.0091 0.5948 0.1294 1.4179
temp: 298.150 k
press: 1.00000 atm
elementType: 8 8 8 8 7 6 6 6 6 6 6 6 6 6 6 6 6 6 6 1 1 1 1 1 1 1 1 1 1 1 1 1 1 1
symmnumber: 1
zpe: 706858.9 jmol-1
zpe.correction: 0.269228 hartree
zpe.thermalcorrener: 0.284202 hartree
zpe.thermalcorrenthalpy: 0.285146 hartree
zpe.thermalcorrgfe: 0.225579 hartree
zpe.sumelectzpe: -896.633889 hartree
zpe.sumelectthermal: -896.618916 hartree
zpe.sumelectthermalent: -896.617971 hartree
zpe.sumelectthermalfe: -896.677538 hartree
dipole: -8.7718 0.0480 -1.4502
dipole: 8.8910
quadrupole: -133.7684 -108.2975 -108.1854
quadrupole: 1.0974 -2.1417 0.9828
quadrupole: -17.0180 8.4529 8.5651 1.0974 -2.1417 0.9828
hfenergy: -896.9031176 hartree
pointgroup: C01 [X(C14H15N1O4)]
dipole: -3.4569565 0.506132 0.1709765 debye
polarizability: 248.4238955|-7.3992241|111.7835578|-1.3332145|-18.5370624|147.045825 unknown
InChI: InChI=1S/C14H15NO4/c16-15(17)10-4-1-8(2-5-10)14-18-12-7-9-3-6-11(12)13(9)19-14/h1-2,4-5,9,11-14H,3,6-7H2
charge 0 multiplicity 1
34 atoms
O  -1.337867 0.49359 -0.932605
O  -1.263736 -0.364155 1.34641
O  5.588501 0.233329 -1.192104
O  5.645619 -0.684886 0.894326
N  5.015275 -0.154114 -0.100836
C  -3.37738 0.73725 0.571405
C  -3.50814 -0.743711 -1.177573
C  -2.818223 0.621193 -0.881805
C  -2.735705 -0.554105 1.148721
C  -2.999314 -1.610155 0.017739
C  -4.905887 0.522218 0.36702
C  -4.99507 -0.38044 -0.920014
C  -0.713684 0.601277 0.386928
C  0.776948 0.362041 0.243259
C  1.446195 0.767948 -0.937843
C  1.507516 -0.222984 1.307045
C  2.838678 0.598828 -1.05991
C  2.900773 -0.396491 1.20083
C  3.547085 0.021927 0.016908
H  -3.132749 1.649804 1.136767
H  -3.298022 -1.167825 -2.170699
H  -3.109098 1.434433 -1.569115
H  -3.113769 -0.848998 2.139747
H  -3.745437 -2.366904 0.318539
H  -2.054612 -2.128136 -0.21291
H  -5.419894 1.488236 0.220806
H  -5.360532 0.041959 1.252275
H  -5.618674 -1.277832 -0.768195
H  -5.422047 0.182551 -1.770007
H  -0.903531 1.627164 0.779359
H  0.864465 1.196045 -1.758434
H  0.971811 -0.550893 2.201464
H  3.380091 0.898951 -1.960684
H  3.489414 -0.845613 2.004783
