program: Gaussian 09
title: 000274359
version: EM64L-G09RevD.01
frameworkgroup: C1[X(C16H15Br)]
method: RPBEPBE
basis: SDD
operation: Freq
keyword: #p
keyword: freq=noraman
keyword: PBEPBE/SDD
title: #p freq=noraman PBEPBE/SDD
converged: YES YES NO NO
title: Mulliken charges:
elementType: Br C C C C C C C C C C C C C C C C H H H H H H H H H H H H H H H
charge: -0.009004 0.043396 -0.170115 -0.600881 0.485987 0.445413 -0.701103 -0.389272 -0.415190 -0.421548 -0.379940 -0.231715 -0.230317 -0.229925 -0.241666 -0.242383 -0.241820 0.246029 0.278951 0.237042 0.233189 0.245665 0.233229 0.238275 0.232145 0.225822 0.224879 0.226288 0.223876 0.227391 0.227655 0.229645
chargesum: 0.00000
title: Mulliken charges with hydrogens summed into heavy atoms:
elementType: Br C C C C C C C C C C C C C C C C
charge: -0.009004 0.043396 -0.170115 -0.075901 0.485987 0.445413 0.014794 -0.156042 -0.176915 -0.189403 -0.154118 -0.006836 -0.004029 -0.006050 -0.014275 -0.014728 -0.012174
polarizability: 2.07473033e+02 -1.40081414e+01 1.64215203e+02 8.15402278e+00 5.28048242e+00 1.64734631e+02
1716.lowfreq: -4.5317 -0.0007 -0.0002 0.0003 4.2968 8.2125 26.6361 44.6691 63.1011
frequency: 26.4911 44.6516 63.0512 68.5883 86.2369 128.3673 174.4055 210.2112 221.2622 257.1441 266.4847 272.3362 314.1526 362.3283 395.8628 400.9696 407.4309 471.9117 476.7911 544.4818 594.1121 605.8344 614.8723 620.5938 685.9835 698.4233 709.9987 753.2313 776.0763 816.8197 832.3336 846.4840 854.9036 894.3607 914.9571 928.9852 937.8770 971.9806 976.9180 990.2081 991.3113 992.9411 994.8806 1007.1880 1018.9541 1035.8859 1039.4345 1077.2890 1080.5525 1090.8063 1097.1179 1142.9172 1171.8099 1172.6852 1185.0704 1189.7482 1203.4655 1273.8421 1309.1792 1317.0499 1345.5335 1372.2859 1377.8284 1393.1827 1430.8693 1434.7349 1454.2277 1457.8013 1471.2553 1481.3389 1483.4321 1586.7053 1589.8360 1608.0904 1611.4703 2986.4753 3084.1769 3088.9150 3092.8729 3120.1392 3121.1740 3123.8653 3127.3308 3136.8356 3139.7660 3146.4488 3149.8435 3163.5592 3164.3976 3199.0458
redmass: 3.8409 4.9108 5.5103 4.5151 5.8186 3.6763 6.5084 1.7379 1.8554 4.3751 4.3158 2.6767 3.4914 3.4008 4.1672 2.7904 2.8672 3.1620 3.2771 3.3635 4.1704 4.4032 6.4416 5.2708 5.6441 1.7783 1.6005 1.8855 2.1294 2.5437 2.9647 1.2773 1.2581 2.6414 1.4125 1.6968 1.4319 1.3997 1.3842 5.9475 2.8962 1.6968 1.3358 2.4057 2.9422 1.7327 1.8160 1.5776 1.5648 1.6701 1.5040 1.9960 1.0521 1.0514 1.1117 1.1220 3.7778 3.7316 1.3843 1.3586 3.6130 7.1730 7.8940 1.2356 2.2024 2.2301 1.1450 1.0911 1.0684 2.3302 2.3066 6.0963 6.1626 6.1577 6.1066 1.0352 1.0983 1.1002 1.0582 1.0848 1.0847 1.0873 1.0872 1.0918 1.0922 1.0964 1.0960 1.1015 1.1014 1.1139
irintensity: 0.0207 0.1858 0.2290 0.2096 0.3061 0.3413 0.3609 0.8140 0.7876 0.2978 0.2142 2.2962 1.3762 2.7993 0.0497 0.1463 0.0381 2.5186 11.1028 22.1860 24.0790 3.9923 0.1202 4.4797 0.5990 27.6394 87.7679 27.6926 27.6520 2.2279 10.5753 0.4979 0.2137 2.8618 1.5595 3.2314 1.7104 0.0846 0.0906 0.6475 0.0881 0.0959 0.3450 15.7549 10.7727 0.9414 4.0034 10.0878 3.3940 23.2121 37.1862 42.5943 0.0187 0.0419 0.4777 0.0648 0.4595 5.6555 0.9487 2.4070 3.8546 0.4414 0.0162 12.4302 0.8163 16.5243 22.8934 4.1642 6.6492 29.8327 14.2634 0.2638 2.8444 13.8501 5.7569 18.9952 19.5900 17.1332 7.7596 6.7976 4.4131 0.6424 0.3946 20.7069 23.2011 15.0443 56.8374 30.3108 12.4602 6.5743
temp: 298.150 k
press: 1.00000 atm
elementType: 35 6 6 6 6 6 6 6 6 6 6 6 6 6 6 6 6 1 1 1 1 1 1 1 1 1 1 1 1 1 1 1
symmnumber: 1
zpe: 673220.5 jmol-1
zpe.correction: 0.256416 hartree
zpe.thermalcorrener: 0.271772 hartree
zpe.thermalcorrenthalpy: 0.272716 hartree
zpe.thermalcorrgfe: 0.212095 hartree
zpe.sumelectzpe: -630.932643 hartree
zpe.sumelectthermal: -630.917287 hartree
zpe.sumelectthermalent: -630.916343 hartree
zpe.sumelectthermalfe: -630.976964 hartree
dipole: 2.3167 0.1585 0.4740
dipole: 2.3700
quadrupole: -109.0691 -107.3916 -98.6908
quadrupole: -6.3569 1.1269 0.9764
quadrupole: -4.0186 -2.3411 6.3597 -6.3569 1.1269 0.9764
hfenergy: -631.1890591 hartree
pointgroup: C01 [X(C16H15Br1)]
dipole: 0.7564981 0.504651 0.2061304 debye
polarizability: 208.6972501|11.3339011|162.6153218|5.3936351|8.8203828|165.1102943 unknown
InChI: InChI=1S/C16H15Br/c1-15(17)12-16(15,13-8-4-2-5-9-13)14-10-6-3-7-11-14/h2-11H,12H2,1H3
charge 0 multiplicity 1
32 atoms
Br -1.657842 -3.156956 -0.305268
C  0.00006 -0.682929 0.451797
C  0.027414 -2.227578 0.302771
C  -0.019128 -1.605322 1.694271
C  -1.250168 0.123342 0.143925
C  1.280544 0.074408 0.129383
C  1.249755 -2.990901 -0.176178
C  -1.740787 0.228221 -1.182442
C  1.989304 0.749155 1.154539
C  -1.901824 0.84879 1.17157
C  1.756175 0.16935 -1.203928
C  -2.861366 1.035942 -1.472315
C  3.146254 1.504151 0.856751
C  -3.022024 1.660537 0.884287
C  2.913585 0.919734 -1.504254
C  -3.505854 1.757386 -0.440276
C  3.61327 1.59194 -0.474693
H  0.88763 -1.703897 2.302251
H  -0.957352 -1.672913 2.251517
H  1.281731 -3.05375 -1.277758
H  2.170822 -2.484585 0.165151
H  1.240881 -4.016968 0.23108
H  -1.25882 -0.33946 -1.985721
H  1.628808 0.686927 2.188169
H  -1.529239 0.777357 2.200334
H  1.220873 -0.348588 -2.008238
H  -3.23498 1.098949 -2.500584
H  3.680656 2.023086 1.660611
H  -3.515646 2.214688 1.690713
H  3.269551 0.980722 -2.538866
H  -4.375856 2.384346 -0.665712
H  4.510373 2.176317 -0.707589
