program: Gaussian 09
title: 000026393
version: EM64L-G09RevD.01
frameworkgroup: C1[X(C14H18N2)]
method: RPBEPBE
basis: SDD
operation: Freq
keyword: #pfreq=noraman
keyword: PBEPBE/SDD
title: #p freq=noraman PBEPBE/SDD
converged: YES YES NO NO
title: Mulliken charges:
elementType: N N C C C C C C C C C C C C C C H H H H H H H H H H H H H H H H H H
charge: -0.079554 -0.408201 -0.365902 -0.347859 -0.437789 -0.449507 -0.374860 -0.567298 0.413802 0.105694 -0.449705 0.226345 -0.408932 -0.354800 -0.261883 -0.218618 0.225038 0.174924 0.174243 0.219615 0.226639 0.205514 0.206619 0.224580 0.191858 0.226739 0.218447 0.220726 0.269084 0.302215 0.230221 0.224896 0.218161 0.219550
chargesum: 0.00000
title: Mulliken charges with hydrogens summed into heavy atoms:
elementType: N N C C C C C C C C C C C C C C
charge: -0.079554 -0.105987 0.034060 0.045999 -0.005635 -0.018308 0.043736 -0.128125 0.413802 0.105694 -0.180622 0.226345 -0.178710 -0.129904 -0.043721 0.000932
polarizability: 2.04936187e+02 -8.35306246e+00 1.73875127e+02 -1.21808221e+01 -3.10236516e-01 1.03850490e+02
1716.lowfreq: -10.9660 0.0001 0.0005 0.0007 4.1295 10.2275 24.0007 34.1892 43.1231
frequency: 23.6246 34.0675 42.6220 57.1247 95.2619 134.7698 177.7801 212.3655 218.8816 232.4105 316.9891 333.6268 403.8897 423.2352 458.2858 499.5835 533.6929 560.6128 575.9183 600.8684 636.0497 642.5075 729.7260 746.9578 747.5409 755.6893 775.6655 788.3589 805.1170 848.1578 851.0428 860.9562 868.0796 900.0208 929.1304 959.3397 968.1330 968.5863 1010.4690 1018.8485 1037.9588 1067.2083 1072.3811 1091.9379 1093.2611 1116.3106 1132.8124 1144.7443 1166.3348 1182.7039 1192.3871 1205.9412 1224.9482 1236.6657 1239.7350 1253.5902 1277.2808 1287.8261 1289.0020 1294.9192 1301.2082 1326.0825 1342.8145 1349.3095 1376.9883 1390.7152 1420.6357 1459.3335 1462.3260 1465.0405 1474.1596 1479.0171 1481.0242 1481.9150 1496.6626 1564.5250 1586.8495 1631.4108 2822.7483 2831.7791 2847.5228 2979.3326 3010.0124 3018.0732 3022.4954 3034.7616 3045.8800 3050.5431 3065.4402 3090.8500 3120.0683 3127.2790 3141.6923 3160.3874 3219.2075 3614.5599
redmass: 2.9451 3.8977 1.6534 3.7109 2.8927 3.3258 3.2640 2.5883 3.8188 2.8954 4.9423 2.1739 3.9860 2.8362 3.4393 1.2155 5.4927 5.0732 3.0294 3.3015 2.9978 3.2731 2.5517 2.0987 1.7639 2.2001 2.1726 1.4115 1.6003 1.4936 1.5230 2.9880 4.7685 2.6753 1.3815 2.1949 1.4962 1.3652 2.0471 1.9512 3.6692 2.5875 3.0668 1.5727 1.5803 2.2607 1.5153 2.2854 1.1063 1.2603 1.3345 1.4340 1.7861 1.3299 2.0707 1.4127 1.3073 1.2418 1.4565 1.2488 1.7612 1.4835 1.4884 1.7292 1.4360 5.0914 2.3593 2.7060 1.2715 1.0857 1.0942 1.0818 1.1376 2.7080 1.1035 6.3005 6.2148 6.8840 1.0716 1.0718 1.0699 1.0625 1.0595 1.0861 1.0663 1.0856 1.0879 1.0992 1.1046 1.1053 1.0848 1.0889 1.0951 1.1001 1.0983 1.0808
irintensity: 0.6516 0.6834 0.1302 0.7808 0.5387 0.2262 1.6600 4.1636 7.5020 0.6485 0.0474 6.7072 1.7808 12.9893 3.5856 97.8069 2.1742 5.3902 8.5853 2.9470 0.1753 0.2346 1.0636 46.1641 67.4455 2.1118 17.9145 2.3304 11.0039 0.3883 3.7778 13.4381 2.8111 5.5054 2.2365 2.4910 1.3539 0.5320 8.6082 9.1423 2.5757 4.8364 4.2252 3.0063 43.5761 24.2078 3.1484 48.9194 1.6124 1.1657 6.9457 7.8810 16.5683 3.3600 12.8913 6.3099 3.7826 4.7412 1.7777 1.9647 2.6260 9.6477 2.1429 28.0106 6.7015 35.0605 2.8999 14.8978 9.0889 3.9298 5.2784 5.5530 9.0280 1.6047 5.5455 2.0406 0.1907 2.2126 67.7503 32.5315 202.6205 28.6588 22.3375 12.1730 76.3225 69.3605 18.6968 34.7174 1.4975 73.8664 3.4881 4.1949 42.6024 30.2438 1.4654 58.7529
temp: 298.150 k
press: 1.00000 atm
elementType: 7 7 6 6 6 6 6 6 6 6 6 6 6 6 6 6 1 1 1 1 1 1 1 1 1 1 1 1 1 1 1 1 1 1
symmnumber: 1
zpe: 763496.1 jmol-1
zpe.correction: 0.290800 hartree
zpe.thermalcorrener: 0.305185 hartree
zpe.thermalcorrenthalpy: 0.306129 hartree
zpe.thermalcorrgfe: 0.247140 hartree
zpe.sumelectzpe: -652.601872 hartree
zpe.sumelectthermal: -652.587488 hartree
zpe.sumelectthermalent: -652.586543 hartree
zpe.sumelectthermalfe: -652.645532 hartree
dipole: -0.5233 -1.2032 0.5049
dipole: 1.4059
quadrupole: -84.6221 -85.8620 -99.8126
quadrupole: 10.6796 -2.2570 -1.4852
quadrupole: 5.4768 4.2369 -9.7137 10.6796 -2.2570 -1.4852
hfenergy: -652.8926728 hartree
pointgroup: C01 [X(C14H18N2)]
dipole: -0.1871005 0.5007923 -0.1419172 debye
polarizability: 205.1896569|5.6217275|172.499225|14.0814638|7.5807056|104.9729217 unknown
InChI: InChI=1S/C14H18N2/c1-2-6-14-13(5-1)12(11-15-14)7-10-16-8-3-4-9-16/h1-2,5-6,11,15H,3-4,7-10H2
charge 0 multiplicity 1
34 atoms
N  2.968186 0.28042 -0.059504
N  -2.795158 2.005054 0.112596
C  3.845411 0.133235 -1.251085
C  3.309585 -0.880858 0.804064
C  5.213479 -0.285648 -0.655657
C  4.855377 -0.978579 0.703798
C  1.536045 0.425927 -0.386783
C  0.679784 0.786722 0.855691
C  -0.776414 0.999544 0.521682
C  -1.749085 -0.024584 0.168387
C  -1.454611 2.217465 0.476973
C  -3.005576 0.635388 -0.082371
C  -1.683711 -1.439232 0.049639
C  -4.173842 -0.070808 -0.446191
C  -2.845043 -2.149932 -0.310189
C  -4.076714 -1.47281 -0.557885
H  3.889027 1.0795 -1.819724
H  3.46708 -0.664478 -1.942807
H  2.834096 -1.823085 0.421529
H  2.960654 -0.724879 1.839509
H  5.844192 0.602068 -0.47797
H  5.76204 -0.956669 -1.339594
H  5.191968 -2.029419 0.742176
H  5.330801 -0.443738 1.543516
H  1.126688 -0.504092 -0.862355
H  1.432779 1.237746 -1.131443
H  0.772313 -0.022017 1.607596
H  1.112231 1.696419 1.31181
H  -1.081428 3.219483 0.682604
H  -3.502394 2.730068 0.019362
H  -0.744122 -1.971372 0.238304
H  -5.122992 0.443867 -0.634647
H  -2.808584 -3.241145 -0.403771
H  -4.962763 -2.053559 -0.838257
