program: Gaussian 09
title: 000274339
version: EM64L-G09RevD.01
frameworkgroup: C1[X(C10H9N3O2S)]
method: RPBEPBE
basis: SDD
operation: Freq
keyword: #p
keyword: freq=noraman
keyword: PBEPBE/SDD
title: #p freq=noraman PBEPBE/SDD
converged: YES YES NO NO
title: Mulliken charges:
elementType: S O O N N N C C C C C C C C C C H H H H H H H H H
charge: 0.328338 -0.435362 -0.225427 -0.177965 -0.082555 0.004930 0.614366 -0.398156 -0.174580 -0.334868 -0.648533 -0.264944 -0.217314 -0.242487 -0.310481 0.181124 0.251401 0.242434 0.291319 0.242315 0.250162 0.233119 0.236064 0.259193 0.377906
chargesum: 0.00000
title: Mulliken charges with hydrogens summed into heavy atoms:
elementType: S O O N N N C C C C C C C C C C
charge: 0.328338 -0.057455 -0.225427 -0.177965 -0.082555 0.004930 0.614366 -0.398156 -0.174580 -0.083468 0.127535 -0.014781 0.015805 -0.006423 -0.051288 0.181124
polarizability: 3.62051262e+02 -6.35789110e+00 1.54900628e+02 -2.21516603e-03 2.58572743e-03 6.20374790e+01
1716.lowfreq: -11.1852 -4.9864 -0.4417 -0.0012 0.0001 0.0012 37.4228 48.7730 50.0724
frequency: 37.4218 48.7680 50.0685 107.8341 130.4272 161.3209 172.1698 190.5417 203.6799 234.9535 263.8240 282.5153 345.9951 360.5941 419.9799 435.5679 460.7954 474.7490 513.0964 537.2453 582.7667 595.7042 601.1136 631.3470 680.1472 689.2193 693.8474 726.1734 756.3979 830.4776 852.3933 922.1100 934.3412 938.9160 978.9276 989.9775 1014.3738 1025.4682 1035.5127 1091.8952 1123.0755 1132.0841 1132.2838 1175.4457 1238.9224 1258.9671 1310.8134 1325.0001 1358.4055 1401.3228 1424.9259 1443.9892 1466.4639 1474.3008 1486.8626 1502.1285 1586.9716 1595.4589 1603.7684 1653.2824 2992.2575 3078.8375 3096.6467 3134.1370 3140.9798 3152.5961 3164.2374 3176.5029 3528.8099
redmass: 8.2914 9.4356 8.0274 5.2535 3.1269 1.0875 8.4256 3.6209 5.0111 5.4961 4.1056 6.1397 6.1338 5.8209 10.0999 3.2115 7.9983 8.3492 5.5338 4.3988 1.2381 7.1055 5.0917 8.4743 6.5276 7.3762 4.9649 3.0822 1.4109 4.8817 1.3663 1.5101 1.3782 6.0572 1.3160 3.9770 4.6129 3.3610 2.7564 2.8616 1.3050 1.5621 1.8554 1.0827 1.5115 1.6915 2.6580 3.2817 2.3948 6.9518 1.3164 2.2197 2.8086 1.3781 1.0433 3.3035 7.6156 7.4160 6.9754 8.8520 1.0348 1.1026 1.0903 1.0996 1.0857 1.0899 1.0951 1.1006 1.0642
irintensity: 2.7569 0.0003 0.6780 2.3206 1.6206 0.1966 0.6628 5.4777 1.0195 3.5614 0.9371 3.8007 1.1812 3.4594 0.9724 9.0989 8.3590 39.6207 9.7945 0.2299 137.1045 5.4788 45.7953 6.6111 7.9321 7.4823 34.8531 8.8494 94.4018 139.6999 0.3867 29.9721 3.3459 26.2834 0.0202 465.1560 299.4666 7.0593 100.1728 80.4638 0.1191 4.9158 69.7357 7.2676 1.5503 24.4724 80.7931 8.7672 35.2444 15.2746 90.3336 2.7752 235.1794 230.7508 18.8116 1247.5821 99.7017 20.9879 19.4423 200.9340 43.9237 19.7518 8.9907 0.9780 1.2979 6.1283 14.6379 20.6074 69.8198
temp: 298.150 k
press: 1.00000 atm
elementType: 16 8 8 7 7 7 6 6 6 6 6 6 6 6 6 6 1 1 1 1 1 1 1 1 1
symmnumber: 1
zpe: 467513.4 jmol-1
zpe.correction: 0.178066 hartree
zpe.thermalcorrener: 0.192663 hartree
zpe.thermalcorrenthalpy: 0.193607 hartree
zpe.thermalcorrgfe: 0.135312 hartree
zpe.sumelectzpe: -1098.056685 hartree
zpe.sumelectthermal: -1098.042088 hartree
zpe.sumelectthermalent: -1098.041144 hartree
zpe.sumelectthermalfe: -1098.099439 hartree
dipole: 5.0358 3.3053 -0.0036
dipole: 6.0236
quadrupole: -82.9644 -93.0491 -102.9501
quadrupole: -2.9535 0.0154 0.0017
quadrupole: 10.0235 -0.0613 -9.9622 -2.9535 0.0154 0.0017
hfenergy: -1098.234751 hartree
pointgroup: C01 [X(C10H9N3O2S1)]
dipole: -2.0129049 -1.2495853 0.0549998 debye
dipolederiv: -0.0217784 0.102342 -0.0015187 0.659791 -0.3753035 0.0067759 -0.0175254 0.012809 0.1128378 -1.6981733 0.501704 0.000165 0.563155 -0.4766696 -0.0057887 0.0008219 -0.0059551 -0.4477274 -0.8728759 -0.1108376 0.0093148 -0.5939569 -0.9494749 0.0228316 0.0238439 0.019565 -0.3194797 -1.7026876 0.1038913 0.0135397 -0.3694437 -0.6626592 0.0188808 0.0261141 0.0135722 -0.134152 -2.7707692 0.0819162 0.0249713 -0.0867797 -0.514076 0.0098283 0.0290249 0.0079162 -0.2046806 1.8260021 0.1725755 -0.0256998 0.6923221 -0.1221397 -0.0068444 -0.040728 -0.0015323 -0.103688 0.5713234 -0.3463138 0.0046423 -0.6842524 0.0945672 0.0067263 0.0144086 0.0031106 0.083416 0.4065804 0.034471 -0.0063724 0.2970193 -0.1997804 -0.0005446 -0.0136317 0.0021667 -0.1104053 2.8045058 -0.0974431 -0.0259737 -0.9719607 0.9080213 -0.0137808 -0.000537 -0.0231649 0.0537999 0.0185184 0.1100234 -0.0052463 -0.0683201 0.050907 -0.0059609 -0.0003309 -0.0077179 -0.1852238 -0.0209353 0.0214049 0.0022127 0.2315795 0.49299 -0.0099591 -0.0035919 -0.0076604 0.2358269 0.046038 -0.0075701 -0.0013093 -0.1429282 0.1356907 -0.0050851 0.0024798 -0.0065266 -0.1004295 -0.0087072 0.0201509 -0.0020418 0.3107758 0.0157458 -0.0079852 -0.0101142 -0.0049666 -0.1549461 -0.2315814 -0.0274553 0.0013232 -0.1766317 -0.0035506 -0.0028412 0.005421 -0.0043777 -0.1731523 -1.7379786 -0.2070266 0.0236988 -0.2062791 0.2100109 -0.0061807 0.0238195 -0.0061906 -0.0924952 2.8296932 -0.1718985 -0.0246687 0.7927253 1.2177086 -0.0344888 -0.0538621 -0.0249721 0.2369928 0.0980791 -0.0028727 0.0008391 -0.0399335 -0.0745054 0.0073024 0.0018794 0.0069202 0.1713641 0.0444329 -0.097041 0.0989497 -0.0559936 0.0059712 0.0103721 0.0941167 0.0660512 -0.0497645 0.034656 0.1333712 -0.0023461 0.0263839 0.1343611 -0.0003212 0.0004348 -0.001425 0.1315567 0.0396655 -0.1042411 -0.095675 -0.0613597 0.0020706 -0.0116354 -0.0929618 -0.0661954 -0.0408345 0.1010368 -0.0617963 0.0023625 -0.0055889 -0.042555 0.0057259 0.0008107 0.0063161 0.1612101 -0.1162569 -0.0542342 0.0044195 -0.0654487 0.0692539 0.003283 0.0047262 0.0031543 0.1630297 -0.0579731 0.0986094 -0.0003523 0.1014018 0.0092105 0.0033532 -0.0004355 0.003383 0.1685273 0.0315489 -0.0012322 0.0018555 0.0100748 -0.0798787 0.0076592 0.0013864 0.0077352 0.1987382 0.3876364 -0.0904972 0.00291 -0.1563518 0.1540842 0.0086772 0.0044305 0.0079848 0.3996793 unknown
polarizability: 361.5721007|-11.5922022|155.2795358|-2.8692946|-2.4874901|62.1377322 unknown
InChI: InChI=1S/C10H9N3O2S/c1-13-7-4-2-3-5-8(7)16-10(13)12-11-6-9(14)15/h2-6,14H,1H3
charge 0 multiplicity 1
25 atoms
S  -0.244241 1.391723 -0.063659
O  5.858228 -0.46041 -0.079773
O  4.713338 1.57316 -0.122014
N  -1.112058 -1.146064 0.016535
N  1.264815 -1.008941 -0.011405
N  2.295825 -0.062676 -0.049106
C  -2.291665 -0.367706 0.006873
C  -2.033778 1.029369 -0.034808
C  0.071315 -0.427793 -0.015508
C  -3.616595 -0.854571 0.03418
C  -1.12878 -2.618816 0.057518
C  -3.086456 1.958759 -0.049619
C  -4.674665 0.081465 0.019171
C  -4.416514 1.47338 -0.022152
C  3.509001 -0.580332 -0.047853
C  4.677888 0.321896 -0.085565
H  -3.822967 -1.92841 0.066303
H  -1.634064 -2.968918 0.975129
H  -0.087387 -2.970221 0.054423
H  -1.656241 -3.018626 -0.82667
H  -2.885945 3.03401 -0.081633
H  -5.708613 -0.278132 0.039903
H  -5.249695 2.183167 -0.033051
H  3.699308 -1.662516 -0.01995
H  6.641343 0.152805 -0.106969
