program: Gaussian 09
title: 000274326
version: EM64L-G09RevD.01
frameworkgroup: C1[X(C15H15ClN2O)]
method: RPBEPBE
basis: SDD
operation: Freq
keyword: #p
keyword: freq=noraman
keyword: PBEPBE/SDD
title: #p freq=noraman PBEPBE/SDD
converged: YES YES NO NO
title: Mulliken charges:
elementType: Cl O N N C C C C C C C C C C C C C C C H H H H H H H H H H H H H H H
charge: -0.085628 -0.300735 -0.484672 -0.414313 -0.141872 -0.548449 -0.552080 0.304975 0.314914 0.269335 0.328530 -0.437132 -0.433028 -0.374266 -0.380560 -0.253728 0.285847 -0.325833 -0.551264 0.233348 0.233319 0.234475 0.234530 0.238923 0.241871 0.189755 0.301871 0.219924 0.292775 0.296760 0.244070 0.270137 0.280562 0.267637
chargesum: 0.00000
title: Mulliken charges with hydrogens summed into heavy atoms:
elementType: Cl O N N C C C C C C C C C C C C C C C
charge: -0.085628 -0.300735 -0.191897 -0.117554 -0.141872 -0.081782 -0.083075 0.304975 0.314914 0.269335 0.328530 -0.198209 -0.191157 -0.184510 -0.078689 -0.033804 0.285847 0.188374 -0.003065
polarizability: 2.82971759e+02 4.96250502e+00 2.20229212e+02 1.23733266e+01 -8.28649272e+00 9.33855037e+01
1716.lowfreq: -13.6517 -6.6141 -0.0019 -0.0019 -0.0012 3.4462 8.5813 24.4933 50.2217
frequency: 7.0519 23.6162 50.2125 55.0343 76.5380 94.8764 107.8037 133.5558 176.5519 200.4649 214.4328 261.3828 266.2656 330.1007 358.9663 398.2316 446.5079 455.0764 462.7516 471.4226 482.5686 511.2238 552.0461 569.5150 590.8007 606.4206 633.8214 643.3068 647.2677 703.1277 727.6358 742.5547 764.5509 769.9499 801.2138 835.4819 857.6408 858.8935 884.8678 898.6585 954.0340 959.0592 970.1440 971.2566 987.8752 1012.2030 1018.9534 1042.2268 1060.7499 1117.1399 1129.2624 1143.3716 1164.8360 1185.2403 1194.8970 1203.0639 1207.8223 1219.9940 1224.6006 1236.5652 1256.4370 1284.2362 1294.9412 1297.6401 1359.8551 1370.9362 1376.5036 1419.4345 1439.9029 1444.5507 1445.4831 1453.4008 1465.4836 1475.6229 1484.9653 1502.6786 1531.7713 1604.6800 1612.6102 1622.9452 1642.9598 2988.0087 2992.0170 3001.3388 3030.3794 3050.1687 3052.9773 3065.5156 3098.7584 3129.2526 3135.4652 3151.4808 3154.5768 3186.2895 3538.3816 3548.4468
redmass: 6.3529 5.9241 5.8035 6.2950 1.9110 3.7935 5.1368 3.1830 3.7823 6.0129 3.1344 7.9927 3.0894 2.9800 3.0312 1.6330 4.0323 3.5070 3.2902 3.6504 3.2766 6.2270 6.1886 1.5629 4.1845 1.9935 5.6703 5.7344 3.6459 10.9665 4.1342 1.5619 4.8412 1.5948 4.7492 2.5343 2.1262 1.3790 1.3681 4.5923 3.1727 1.3494 2.5227 1.3597 2.6705 1.9283 3.2119 2.1274 1.9096 3.5993 2.5550 1.1728 1.4051 1.4795 1.3715 1.1021 1.6092 1.4918 1.2855 1.4768 2.1615 2.6436 1.4805 1.3493 2.1713 1.6871 2.8941 2.9451 1.1111 1.2588 1.1187 2.0623 1.3411 2.5759 1.9665 3.0676 2.9828 6.5821 7.9086 8.0479 3.8776 1.0591 1.0597 1.0617 1.1027 1.0970 1.1024 1.0617 1.0870 1.0900 1.0913 1.0976 1.1120 1.0930 1.0771 1.0756
irintensity: 0.1246 0.1278 2.8300 9.5453 0.5125 5.8140 8.1537 1.1696 2.7557 3.3381 10.3275 3.4997 1.1382 1.5207 35.6522 13.2357 0.9192 4.5920 0.0185 2.0384 6.3215 4.8961 2.5420 98.0452 24.5892 67.2826 4.3657 8.3069 1.0310 14.1470 11.0235 49.9456 0.1083 44.0116 3.3257 0.4688 15.2358 49.9088 18.1145 4.3070 0.4324 2.7312 15.6867 1.9642 4.4718 0.1940 6.1462 0.5242 2.6496 2.8714 0.7219 0.4768 9.0457 6.3715 26.9657 0.0082 85.0133 11.4775 0.2976 277.3692 32.7150 17.8887 3.6921 98.8532 78.5116 31.7683 29.5795 28.6820 10.5504 30.1773 21.2060 39.1750 40.4841 56.6947 216.9614 325.2918 616.4114 28.2966 2.7608 5.9733 118.6517 20.9340 65.5752 62.1025 0.3526 6.8961 33.4234 24.0532 18.8484 22.5520 19.3026 31.9602 17.7370 4.7060 27.4722 21.0272
temp: 298.150 k
press: 1.00000 atm
elementType: 17 8 7 7 6 6 6 6 6 6 6 6 6 6 6 6 6 6 6 1 1 1 1 1 1 1 1 1 1 1 1 1 1 1
symmnumber: 1
zpe: 706907.9 jmol-1
zpe.correction: 0.269247 hartree
zpe.thermalcorrener: 0.286285 hartree
zpe.thermalcorrenthalpy: 0.287230 hartree
zpe.thermalcorrgfe: 0.220692 hartree
zpe.sumelectzpe: -1224.070828 hartree
zpe.sumelectthermal: -1224.053789 hartree
zpe.sumelectthermalent: -1224.052845 hartree
zpe.sumelectthermalfe: -1224.119383 hartree
dipole: 0.7617 1.4740 -0.2551
dipole: 1.6786
quadrupole: -100.0340 -117.1011 -121.5828
quadrupole: 4.4257 3.6081 -3.6957
quadrupole: 12.8719 -4.1951 -8.6768 4.4257 3.6081 -3.6957
hfenergy: -1224.3400747 hartree
pointgroup: C01 [X(C15H15Cl1N2O1)]
dipole: 0.3561134 0.5532813 -0.0568092 debye
polarizability: 283.2543325|-2.2331279|220.5733712|11.9908812|0.3186974|92.7587714 unknown
InChI: InChI=1S/C15H15ClN2O/c16-8-9-17-15(19)18-13-7-6-11-5-4-10-2-1-3-12(13)14(10)11/h1-3,6-7,17-18H,4-5,8-9H2
charge 0 multiplicity 1
34 atoms
Cl -6.062131 2.083189 0.648199
O  -2.690637 -1.804833 -0.378258
N  -1.327331 0.131353 -0.34394
N  -3.650293 0.318749 -0.550788
C  2.379858 -0.078472 0.04653
C  4.128363 -1.716565 0.268701
C  4.76345 -0.272118 0.295867
C  2.627453 -1.480426 0.109676
C  3.580472 0.684483 0.149563
C  1.083626 0.503277 -0.100986
C  -0.026543 -0.424189 -0.191979
C  1.536408 -2.344724 0.022076
C  3.508341 2.077695 0.106534
C  1.038321 1.939553 -0.140872
C  0.214533 -1.812168 -0.129448
C  2.218903 2.692202 -0.039676
C  -2.55387 -0.543312 -0.418424
C  -5.012782 -0.206066 -0.618354
C  -5.86474 0.188801 0.587529
H  4.355846 -2.271512 1.198156
H  4.535688 -2.316993 -0.566251
H  5.492628 -0.13732 -0.524834
H  5.311721 -0.090859 1.239243
H  1.661109 -3.43253 0.064108
H  4.403807 2.704371 0.182211
H  0.091582 2.485796 -0.247155
H  -0.640066 -2.487761 -0.200242
H  2.155875 3.786088 -0.07194
H  -1.358011 1.14935 -0.410406
H  -3.5443 1.334151 -0.508437
H  -5.511913 0.119243 -1.550906
H  -4.921804 -1.309183 -0.643248
H  -5.39345 -0.081322 1.54322
H  -6.890815 -0.201849 0.518831
