program: Gaussian 09
title: 000274307
version: EM64L-G09RevD.01
frameworkgroup: C1[X(C7H8N2O2S)]
method: RPBEPBE
basis: SDD
operation: Freq
keyword: #p
keyword: freq=noraman
keyword: PBEPBE/SDD
title: #p freq=noraman PBEPBE/SDD
converged: YES YES NO NO
title: Mulliken charges:
elementType: S O O N N C C C C C C C H H H H H H H H
charge: 0.252168 -0.259097 -0.255016 -0.212138 -0.359912 0.276738 -0.431350 -0.258267 -0.668370 0.152753 0.170558 -0.600196 0.249856 0.257402 0.271664 0.293855 0.348512 0.249773 0.271738 0.249327
chargesum: 0.00000
title: Mulliken charges with hydrogens summed into heavy atoms:
elementType: S O O N N C C C C C C C
charge: 0.252168 -0.259097 -0.255016 -0.212138 -0.011400 0.276738 0.075908 -0.258267 -0.102850 0.152753 0.170558 0.170642
polarizability: 1.49438437e+02 1.28627084e+00 1.26672437e+02 -1.62239755e-01 9.10664189e-01 5.71625738e+01
1716.lowfreq: -9.4946 -6.9319 -0.0008 0.0017 0.0019 9.4366 91.4277 101.9805 115.3861
frequency: 91.4220 101.9800 115.3582 135.1518 161.3299 238.2424 261.6661 294.6565 328.0893 353.9933 385.2119 423.2457 508.5044 547.3701 563.7104 597.8671 616.5528 648.8570 695.0732 717.6351 737.9882 838.1024 847.3513 951.8495 972.1564 991.9414 1019.8910 1122.5135 1129.4423 1131.6156 1170.7896 1231.2022 1237.7256 1248.7604 1274.0480 1314.6030 1366.1603 1424.6395 1450.6832 1457.8678 1465.3708 1477.5263 1478.4553 1587.3796 1626.6926 1653.4419 2988.1253 3010.4013 3048.0859 3063.7121 3101.8019 3136.8860 3138.6744 3560.3946
redmass: 3.0709 5.0008 1.1221 3.7500 3.6657 6.0149 3.8961 4.2314 3.8888 9.0320 7.6997 7.3858 6.9573 11.6502 6.0879 1.3142 4.6908 5.2344 3.3933 5.7605 7.5244 2.3291 3.3474 3.5373 2.6800 1.6216 2.8525 2.1034 1.6201 1.3770 1.4647 2.4369 2.2439 2.2159 1.3691 2.2404 2.9850 1.3364 1.0927 2.3583 1.1013 1.0837 1.0779 8.3863 9.9756 6.7097 1.0650 1.0330 1.0653 1.0899 1.1022 1.1093 1.1020 1.0783
irintensity: 3.0109 0.2604 0.5744 3.0234 3.7074 5.3310 8.1087 0.8853 7.6631 4.7450 27.0286 2.9466 7.3561 1.9608 4.4023 86.9043 5.8114 4.5558 0.5110 33.6685 13.2600 8.3309 16.5461 45.2206 34.7401 4.5032 12.9135 4.8792 4.3475 1.5921 19.5007 1.8716 6.0279 14.6022 27.5786 74.5092 82.9479 51.8610 4.8552 187.5427 10.2817 20.5531 18.7705 201.3927 463.6598 448.5889 22.9349 26.8005 14.8317 15.7381 17.4425 10.4292 0.8201 88.0699
temp: 298.150 k
press: 1.00000 atm
elementType: 16 8 8 7 7 6 6 6 6 6 6 6 1 1 1 1 1 1 1 1
symmnumber: 1
zpe: 389038.7 jmol-1
zpe.correction: 0.148177 hartree
zpe.thermalcorrener: 0.159097 hartree
zpe.thermalcorrenthalpy: 0.160042 hartree
zpe.thermalcorrgfe: 0.111353 hartree
zpe.sumelectzpe: -928.709313 hartree
zpe.sumelectthermal: -928.698392 hartree
zpe.sumelectthermalent: -928.697448 hartree
zpe.sumelectthermalfe: -928.746137 hartree
dipole: 3.8263 -0.3963 0.2936
dipole: 3.8580
quadrupole: -72.7125 -86.2097 -76.8422
quadrupole: -0.3762 0.9352 0.3752
quadrupole: 5.8757 -7.6216 1.7459 -0.3762 0.9352 0.3752
hfenergy: -928.8574897 hartree
pointgroup: C01 [X(C7H8N2O2S1)]
dipole: 1.4696654 -0.3781263 0.0304706 debye
dipolederiv: -0.5802735 0.1113269 -0.0030963 0.1117445 -0.2279266 -0.0176583 0.0624904 -0.0243964 -0.042117 -0.6083013 0.1391111 0.0165355 0.1625839 -1.2795684 0.0082701 0.0116374 0.0134061 -0.3607007 -1.1401955 -0.4527765 0.0606829 -0.4251044 -0.7879753 0.0375758 0.0670837 0.041276 -0.3823145 -0.8952331 -0.2454011 0.055913 -0.3973467 -1.06154 0.0449362 0.0615683 0.0285732 -0.2064792 -1.3266435 -0.4440935 0.0877774 0.2585944 -0.5657256 -0.0198309 0.0715856 0.0104707 -0.2759078 -0.6223586 0.5187572 0.0113296 0.5307178 -0.7903621 -0.0271448 -0.0180967 -0.0864584 -0.1132217 -0.0155741 0.0111308 -0.0180401 -0.0062855 -0.0084851 -0.0073202 -0.0186756 -0.0437987 0.1749643 1.133351 0.1385502 -0.0745095 -0.3187101 0.9756751 -0.0035597 -0.0888512 0.0080375 -0.0025508 0.18246 0.1445169 0.0068584 0.2367006 0.208034 0.0875449 0.0470451 0.0708438 0.155623 1.4072991 -0.2353553 -0.077661 0.0344872 1.5807554 -0.0352097 -0.0826704 -0.0084383 0.2393425 1.7406181 0.4907817 -0.1147301 0.1755937 1.2804943 -0.0233731 -0.1164469 -0.0444306 0.3036786 0.3157551 -0.1081466 -0.0064752 -0.206194 0.1273269 0.0169331 -0.0062884 0.0060238 0.2016546 0.0082908 -0.0420916 0.0253447 -0.012113 0.0533799 0.0461435 0.0579911 0.0958221 -0.0998388 0.0925893 0.0173253 -0.0061269 -0.0515639 -0.0319696 -0.0703556 -0.0304017 -0.0601615 0.0547061 -0.0777382 -0.0207375 0.0625708 -0.0432603 0.0587096 -0.0049909 0.0817212 -0.0075021 0.0564152 0.0650677 -0.0113455 -0.0344292 -0.0737715 0.0130948 -0.0321185 -0.0959453 -0.0142622 -0.087204 0.1584778 0.0099503 0.0179036 0.0164959 0.2739421 0.002007 0.0061421 0.0142334 0.3373465 -0.0220171 0.0286065 -0.0579472 -0.0344063 0.0949785 -0.0727922 -0.0876037 -0.0265233 -0.0291959 0.1845756 -0.0843613 -0.0042192 0.0632478 -0.0076168 -0.0048267 -0.0056218 0.0069122 0.1280769 -0.0001494 0.0342522 0.0523186 -0.0214103 0.0947789 0.0757701 0.0833368 0.0203727 -0.0522772 unknown
polarizability: 148.9859625|-2.0925279|126.807434|-5.465795|0.6807959|57.4800509 unknown
InChI: InChI=1S/C7H8N2O2S/c1-9-6(10)4-2-3-12-5(4)8-7(9)11/h8H,2-3H2,1H3
charge 0 multiplicity 1
20 atoms
S  2.533965 -1.621606 -0.283597
O  -0.496347 2.496952 -0.069862
O  -2.592061 -1.724785 0.152389
N  -1.557074 0.388409 0.051957
N  -0.268461 -1.612966 -0.036635
C  0.874438 0.511625 -0.132949
C  2.225698 1.163294 -0.334131
C  0.890226 -0.866291 -0.128439
C  3.298709 0.114132 0.052692
C  -0.382185 1.234076 -0.051237
C  -1.552312 -1.016549 0.060619
C  -2.883721 1.036405 0.153169
H  2.342998 1.475263 -1.390507
H  2.332511 2.071643 0.284548
H  4.218659 0.182024 -0.545986
H  3.536179 0.138282 1.127468
H  -0.263394 -2.633973 -0.000063
H  -3.521894 0.729184 -0.691784
H  -2.716386 2.123026 0.133584
H  -3.380746 0.737352 1.090659
