program: Gaussian 09
title: 000026375
version: EM64L-G09RevD.01
frameworkgroup: C1[X(C9H20)]
method: RPBEPBE
basis: SDD
operation: Freq
keyword: #p
keyword: freq=noraman
keyword: PBEPBE/SDD
title: #p freq=noraman PBEPBE/SDD
converged: YES YES NO NO
title: Mulliken charges:
elementType: C C C C C C C C C H H H H H H H H H H H H H H H H H H H H
charge: 0.010469 -0.036799 -0.408722 -0.361827 -0.767880 -0.736379 -0.740577 -0.356989 -0.697729 0.180230 0.211066 0.182174 0.193188 0.185054 0.195460 0.210693 0.223213 0.214358 0.210822 0.210887 0.211244 0.222857 0.214552 0.209028 0.194599 0.193317 0.209526 0.214975 0.209191
chargesum: 0.00000
title: Mulliken charges with hydrogens summed into heavy atoms:
elementType: C C C C C C C C C
charge: 0.190699 0.174267 -0.033359 0.018686 -0.119617 -0.103426 -0.094140 0.030927 -0.064037
polarizability: 1.12998436e+02 1.50251907e-01 9.36956673e+01 -8.85166332e-01 1.93675394e-01 8.76256138e+01
1716.lowfreq: -5.8972 -0.0004 -0.0001 0.0001 12.3169 12.8721 42.1533 59.0946 84.3453
frequency: 41.5335 59.0844 84.2479 100.7950 150.7076 192.5914 220.3486 226.5455 232.7891 251.0164 285.0992 293.3823 310.2155 384.4160 448.0750 501.5438 539.6793 709.7354 732.5459 791.9767 878.5585 889.1651 906.3542 920.4289 928.6174 956.9668 995.7556 999.6686 1039.3642 1058.8004 1078.0723 1088.7284 1134.8777 1154.9435 1168.4849 1198.2755 1216.5833 1252.0933 1273.4470 1286.3472 1296.8336 1313.8422 1328.9530 1341.7963 1347.6261 1361.1006 1376.3016 1382.6476 1388.1524 1396.1464 1460.1263 1464.3436 1466.7113 1469.9730 1475.1489 1475.9734 1482.1575 1485.5443 1487.6156 1490.0497 1491.7885 2936.0453 2951.9167 2956.4560 2965.0326 2968.0823 2969.8357 2970.5057 2973.5167 2977.8160 2991.3369 3007.3404 3032.1288 3060.1867 3062.6359 3063.2823 3066.7628 3068.2232 3069.8330 3073.1942 3076.4109
redmass: 2.4952 1.6018 2.4186 2.7997 1.9229 1.0375 1.1192 1.1823 1.3496 1.8625 2.4263 2.1897 2.9145 2.2367 2.6183 2.4912 2.1397 1.9549 1.2021 1.2443 2.1761 1.5717 1.3200 1.2583 1.6083 1.3556 2.2552 1.2779 2.5378 1.5505 2.2937 2.0568 2.0620 2.2002 2.1363 1.9962 1.4572 1.2645 1.2228 1.0992 1.3308 1.2517 1.4201 1.5203 1.4680 1.4921 1.2129 1.2260 1.2172 1.2078 1.0663 1.0578 1.0578 1.0529 1.0630 1.0425 1.0550 1.0678 1.0566 1.0603 1.0573 1.0822 1.0597 1.0598 1.0658 1.0453 1.0637 1.0364 1.0356 1.0386 1.0958 1.1016 1.1037 1.0996 1.0989 1.0994 1.1006 1.0987 1.0992 1.0987 1.0982
irintensity: 0.0173 0.0057 0.0045 0.0204 0.0410 0.0242 0.0281 0.1232 0.0307 0.0337 0.0093 0.0151 0.1130 0.3959 0.3656 0.7651 3.2981 3.6101 6.1699 1.2036 5.7770 0.9112 4.9021 1.1005 0.1952 0.8724 5.3849 2.4253 5.5463 1.6723 0.3252 14.1983 14.2217 2.0413 0.3935 2.5709 0.4831 1.9010 0.4465 0.5314 0.3582 0.1962 0.3202 3.0386 1.0006 0.3322 19.1450 20.7924 10.1197 20.4442 1.4099 0.8542 0.9955 12.3431 6.9382 12.8824 5.2757 19.4210 9.2056 2.6357 10.7477 23.2303 1.0197 16.1512 45.0568 29.6328 98.9450 42.6726 24.4022 20.2087 8.1847 4.6610 66.2839 5.4770 78.1523 8.9508 110.5819 62.3961 59.9387 55.4694 55.5599
temp: 298.150 k
press: 1.00000 atm
elementType: 6 6 6 6 6 6 6 6 6 1 1 1 1 1 1 1 1 1 1 1 1 1 1 1 1 1 1 1 1
symmnumber: 1
zpe: 705828.0 jmol-1
zpe.correction: 0.268836 hartree
zpe.thermalcorrener: 0.281450 hartree
zpe.thermalcorrenthalpy: 0.282394 hartree
zpe.thermalcorrgfe: 0.230194 hartree
zpe.sumelectzpe: -354.176412 hartree
zpe.sumelectthermal: -354.163797 hartree
zpe.sumelectthermalent: -354.162853 hartree
zpe.sumelectthermalfe: -354.215053 hartree
dipole: -0.1253 -0.0171 -0.0867
dipole: 0.1533
quadrupole: -62.0243 -60.8288 -60.6423
quadrupole: -0.4654 -0.0121 -0.3990
quadrupole: -0.8591 0.3363 0.5228 -0.4654 -0.0121 -0.3990
hfenergy: -354.4452472 hartree
pointgroup: C01 [X(C9H20)]
dipole: 0.0484385 0.0038612 -0.0357264 debye
polarizability: 113.027424|0.1110077|93.6283048|0.2443708|-0.664475|87.6639883 unknown
InChI: InChI=1S/C9H20/c1-5-6-7-9(4)8(2)3/h8-9H,5-7H2,1-4H3
charge 0 multiplicity 1
29 atoms
C  -0.975801 -0.687932 -0.291914
C  -1.53045 0.769464 -0.146843
C  0.450285 -0.866993 0.302086
C  1.532625 0.074394 -0.274916
C  -1.923777 -1.763736 0.293957
C  -2.855277 0.961932 -0.925487
C  -1.695647 1.22539 1.323944
C  2.960889 -0.300397 0.184657
C  4.043251 0.648879 -0.373286
H  -0.894904 -0.875448 -1.386494
H  -0.781949 1.439669 -0.619078
H  0.764902 -1.916321 0.118811
H  0.412129 -0.752642 1.40549
H  1.488693 0.049811 -1.384556
H  1.326884 1.123176 0.021126
H  -1.51938 -2.776507 0.107591
H  -2.931041 -1.719783 -0.157184
H  -2.035447 -1.649772 1.388595
H  -3.68764 0.403882 -0.457774
H  -3.144953 2.029494 -0.946999
H  -2.760137 0.614932 -1.972222
H  -0.745765 1.159833 1.885219
H  -2.447473 0.611174 1.853769
H  -2.037597 2.276496 1.365984
H  2.998651 -0.296525 1.293455
H  3.181811 -1.341357 -0.128661
H  4.044954 0.640112 -1.479856
H  5.053998 0.359092 -0.031394
H  3.862064 1.690881 -0.047922
