program: Gaussian 09
title: 000274294
version: EM64L-G09RevD.01
frameworkgroup: C1[X(C10H7Br2N3OS)]
method: RPBEPBE
basis: SDD
operation: Freq
keyword: #p
keyword: freq=noraman
keyword: PBEPBE/SDD
title: #p freq=noraman PBEPBE/SDD
converged: YES YES NO NO
title: Mulliken charges:
elementType: Br Br S O N N N C C C C C C C C C C H H H H H H H
charge: 0.040998 0.030367 0.274398 -0.214990 -0.491666 -0.032975 -0.183396 0.655105 0.470420 -0.325608 -0.359982 -0.374016 -0.369835 -0.798298 0.209962 0.205777 -0.639915 0.256462 0.257761 0.359360 0.248101 0.231159 0.232299 0.318513
chargesum: 0.00000
title: Mulliken charges with hydrogens summed into heavy atoms:
elementType: Br Br S O N N N C C C C C C C C C C
charge: 0.040998 0.030367 0.274398 -0.214990 -0.132306 -0.032975 -0.183396 0.655105 0.470420 -0.325608 -0.359982 -0.117554 -0.112074 -0.086739 0.209962 0.205777 -0.321403
polarizability: 2.73630837e+02 -4.25936942e-01 1.86714573e+02 -3.29531271e+00 -1.27740201e+01 1.07232704e+02
1716.lowfreq: -35.4757 -1.6551 -0.0012 -0.0007 0.0005 1.5553 4.6620 25.3389 33.6635
frequency: -35.2935 25.3386 33.6611 34.5927 78.4044 82.9640 109.9426 140.5927 167.5871 177.2173 178.7202 200.2626 234.1212 276.8706 292.4343 304.4798 349.4813 373.2039 443.7394 450.4441 505.7165 508.7737 521.2909 557.8356 595.7974 617.6385 652.3390 703.7601 714.7450 737.0573 756.4563 842.3177 845.7672 858.8076 861.9049 893.6794 896.6219 913.6952 1004.4606 1038.4216 1047.2349 1073.7324 1187.7193 1198.3678 1217.0288 1244.3925 1281.5077 1343.1703 1379.3127 1399.1150 1433.1019 1443.9415 1465.1621 1472.1500 1473.3292 1489.4227 1546.2792 1597.9837 1622.8939 2982.9611 3066.4138 3094.7239 3158.4876 3163.4751 3224.0749 3483.2423
redmass: 1.0136 18.2828 7.0408 9.2924 13.0874 13.5352 20.1187 7.7737 6.9224 5.8545 5.1346 4.3557 10.8508 7.8147 11.2262 14.6440 6.3648 4.1204 6.7103 8.3037 5.1656 6.0587 3.8228 3.2401 1.9912 3.1347 9.6259 5.0745 7.9200 6.0552 7.1331 6.0960 6.7129 1.3792 1.3752 5.7621 1.4330 5.2209 1.3921 2.8833 1.6397 2.0048 2.2909 1.8006 1.9236 5.5769 2.9712 5.0620 3.3476 1.2137 4.5840 4.9288 1.2243 2.9342 1.2481 2.5324 5.1980 7.3761 8.0473 1.0386 1.0953 1.1001 1.0924 1.0930 1.0934 1.0770
irintensity: 0.4859 0.3995 0.7123 0.3790 4.3454 0.8714 1.9999 5.7771 5.2917 1.1897 0.4535 1.9895 12.4174 4.3110 3.9855 30.3841 1.9958 1.0765 0.8867 0.6430 3.5049 3.2558 1.2688 11.2033 39.7723 29.2743 2.4417 25.1360 70.4006 47.9812 50.9243 2.2416 61.1643 30.0902 21.4472 1.5126 0.8200 35.6919 5.5827 10.9753 10.5645 1.1190 51.4214 28.8258 1.9752 3.4561 29.7746 27.4829 29.6451 11.8655 109.3557 65.3757 75.3268 49.5620 40.8861 396.8162 61.1000 52.7917 117.5811 25.2507 17.1342 14.4008 1.9369 3.7156 15.2168 41.6382
temp: 298.150 k
press: 1.00000 atm
elementType: 35 35 16 8 7 7 7 6 6 6 6 6 6 6 6 6 6 1 1 1 1 1 1 1
symmnumber: 1
zpe: 401169.9 jmol-1
zpe.correction: 0.152798 hartree
zpe.thermalcorrener: 0.168953 hartree
zpe.thermalcorrenthalpy: 0.169897 hartree
zpe.thermalcorrgfe: 0.105366 hartree
zpe.sumelectzpe: -1048.492890 hartree
zpe.sumelectthermal: -1048.476734 hartree
zpe.sumelectthermalent: -1048.475790 hartree
zpe.sumelectthermalfe: -1048.540322 hartree
dipole: -2.8715 0.1515 -0.1276
dipole: 2.8783
quadrupole: -102.0968 -124.7201 -130.0736
quadrupole: -2.9814 4.4133 1.9527
quadrupole: 16.8667 -5.7566 -11.1101 -2.9814 4.4133 1.9527
hfenergy: -1048.6456872 hartree
pointgroup: C01 [X(C10H7Br2N3O1S1)]
dipole: -1.1270614 -0.0856146 0.0688427 debye
dipolederiv: -0.155562 -0.2417404 -0.1142924 -0.2217892 -0.460182 -0.1667571 -0.0895103 -0.1874136 -0.0678291 -0.1548451 0.2451363 0.0412816 0.1965967 -0.5538398 -0.1093359 0.0266294 -0.0877057 -0.0333112 -0.5100484 -0.1863244 0.2641348 -0.0550429 -0.0349896 0.2075979 0.1328777 0.2015506 -0.1257465 -0.6888439 0.0788737 -0.1038292 -0.0832735 -0.4811079 0.2889301 0.1066229 0.2547848 -0.6734969 -1.3899046 -0.1869928 0.2879006 -0.2882842 -0.3839805 0.0563726 0.4454589 0.093189 -0.5389369 -0.9738701 -0.4907438 0.6648306 -0.1008572 0.0614845 -0.0914447 0.1579162 -0.0547845 0.0495922 0.5198996 0.5683337 -0.751617 0.2416384 -0.0616062 -0.1357929 -0.3361635 -0.1570267 0.035383 0.7817619 0.0841128 -0.1297122 -0.144656 -0.4216235 -0.0561146 0.0397158 -0.0946866 0.0426044 0.4552458 -0.0164373 0.0602748 -0.0575253 0.1934992 0.0461943 0.1493022 0.0381237 0.0138505 0.2611208 0.3733784 0.2269576 0.3614358 0.8184848 0.3645377 0.077084 0.3209477 0.0420434 0.2081184 -0.4158989 -0.0152814 -0.3004017 0.9709905 0.1885589 -0.0059096 0.1705027 -0.0770228 -0.3652481 -0.1644697 -0.0698758 -0.2446098 -0.1965853 -0.0892072 -0.1214312 -0.0675605 -0.1384167 -0.360441 0.1480833 0.0180542 0.2757853 -0.2956981 -0.0098788 0.0534245 -0.0056168 -0.1109807 -0.1514432 0.0124965 -0.0324663 0.0462078 0.0216642 -0.0054489 -0.1681757 0.0040173 0.0370935 1.8861065 0.021742 -0.1300703 0.4147461 0.576283 -0.5312672 -0.3563269 -0.4262117 0.9149789 -0.3636438 0.0940494 -0.0988021 -0.022415 -0.0809223 0.1230106 0.0018302 0.1121857 -0.116615 0.4993389 0.0229723 -0.0627295 0.0174636 -0.0844217 -0.1109986 -0.0754109 -0.1074178 -0.0505431 0.044704 0.0591522 0.0142329 0.0716561 -0.0013607 -0.0290922 0.0128912 -0.0326754 0.1457483 0.0362304 -0.0681314 -0.0172227 -0.0694381 0.0115939 -0.0373543 -0.0247969 -0.0312562 0.1442553 0.2424983 0.0256728 -0.0026299 -0.0402643 0.2199884 0.0742389 -0.051073 0.0387433 0.2780383 -0.018715 0.0119656 -0.0332654 0.0237459 0.1031974 0.0445742 -0.0794138 0.0458733 -0.0825285 0.0040996 -0.0416171 0.0071963 -0.1245794 -0.0732728 0.0504777 0.0494978 0.0351619 0.102291 0.0179776 0.02778 0.0168565 0.0891951 -0.0200754 -0.1061692 0.0900579 -0.0931663 0.0376373 0.1754634 0.0386068 -0.0399257 0.0146657 0.1724802 0.0343687 -0.0350969 0.0304417 0.1719111 unknown
polarizability: 273.6693036|1.1830547|188.5989441|-1.3860632|3.3311087|105.3098652 unknown
InChI: InChI=1S/C10H7Br2N3OS/c1-5-2-6(11)9(7(12)3-5)13-10(16)8-4-17-15-14-8/h2-4,13H,1H3
charge 0 multiplicity 1
24 atoms
Br -0.736699 2.673301 1.06706
Br -0.936264 -2.995381 -0.360791
S  5.375952 0.082082 -0.341077
O  0.954007 1.181044 -1.439394
N  0.402193 -0.241936 0.356269
N  3.101013 -0.785292 0.811083
N  4.321665 -1.039187 1.037615
C  -1.012611 -0.132782 0.24908
C  -3.876724 0.042519 0.004101
C  -1.70729 1.08727 0.475323
C  -1.812512 -1.265334 -0.067197
C  -3.105434 1.182186 0.339721
C  -3.212061 -1.195721 -0.179563
C  -5.380213 0.148135 -0.169972
C  1.292262 0.407351 -0.500965
C  2.724503 0.100157 -0.209206
C  3.819756 0.630887 -0.896558
H  -3.598939 2.142985 0.513413
H  -3.783867 -2.095768 -0.423489
H  0.796417 -0.935075 1.002002
H  -5.636538 0.390307 -1.219201
H  -5.885279 -0.799882 0.082698
H  -5.805644 0.944151 0.464942
H  3.703808 1.336683 -1.719795
