program: Gaussian 09
title: 000274321
version: EM64L-G09RevD.01
frameworkgroup: C1[X(C14H20N2O4)]
method: RPBEPBE
basis: SDD
operation: Freq
keyword: #p
keyword: freq=noraman
keyword: PBEPBE/SDD
title: #p freq=noraman PBEPBE/SDD
converged: YES YES NO NO
title: Mulliken charges:
elementType: O O O O N N C C C C C C C C C C C C C C H H H H H H H H H H H H H H H H H H H H
charge: -0.258743 -0.258357 -0.330261 -0.333811 -0.364663 -0.365724 -0.551922 -0.548795 0.062209 0.062124 -0.325875 -0.324788 0.262063 0.264585 -0.380445 -0.385439 0.128404 0.134483 -0.775487 -0.775418 0.231476 0.277582 0.232241 0.271537 0.229477 0.227762 0.229716 0.229863 0.222577 0.251106 0.250857 0.222599 0.328480 0.325943 0.229849 0.239521 0.298264 0.229473 0.240264 0.297274
chargesum: 0.00000
title: Mulliken charges with hydrogens summed into heavy atoms:
elementType: O O O O N N C C C C C C C C C C C C C C
charge: -0.258743 -0.258357 -0.330261 -0.333811 -0.036184 -0.039781 -0.042864 -0.045017 0.062209 0.062124 0.131365 0.134791 0.262063 0.264585 0.093237 0.088017 0.128404 0.134483 -0.007853 -0.008408
polarizability: 1.39953495e+02 -5.99564875e-01 2.19652333e+02 -2.18999750e+00 1.35517116e-01 1.71713345e+02
1716.lowfreq: -9.8944 -7.6734 -5.4736 0.0002 0.0007 0.0009 21.8988 25.6730 33.0753
frequency: 21.6032 25.3038 33.0495 46.7305 49.7238 75.8985 88.8665 94.0800 114.7127 120.5289 124.8097 158.1073 164.4151 182.7211 191.5487 233.5574 239.6808 283.8853 285.4536 315.4439 337.0696 339.5348 396.8130 402.2546 443.1230 467.4698 525.5833 547.8862 550.6009 560.4772 578.4547 635.7492 637.1753 699.2486 704.0956 716.5778 724.5262 770.4890 774.3633 837.9812 839.4650 859.4078 879.9797 883.9465 912.7572 942.2738 946.2282 987.9861 989.8412 1012.7958 1018.1169 1049.5164 1050.0877 1055.1014 1055.6026 1090.2869 1110.1726 1121.6747 1149.7901 1155.3674 1165.2988 1166.1285 1222.4807 1227.0111 1227.3012 1229.2089 1237.3069 1240.8888 1279.0825 1282.0740 1314.7914 1320.3003 1345.3211 1345.9763 1354.0258 1358.9858 1388.9785 1389.4548 1440.3033 1446.4953 1449.5188 1451.5938 1470.4236 1471.4513 1474.3769 1475.7346 1486.2115 1487.7166 1494.1637 1502.9034 1560.3914 1568.5864 1654.8806 1661.5914 2966.3229 2967.9024 2983.3554 2983.7106 3001.2696 3013.0504 3017.9382 3020.0650 3028.1674 3030.8526 3062.2929 3062.9256 3072.3700 3090.3864 3102.1539 3104.0808 3119.1430 3120.3314 3545.2521 3548.5179
redmass: 4.1770 5.4306 3.4317 4.0948 7.3499 3.3632 5.5155 2.2924 1.8715 1.0722 1.0694 3.8073 3.9916 4.1693 3.1736 3.4703 3.2677 3.4379 3.3846 3.4544 4.6630 2.4976 5.8507 6.8934 3.8554 4.5137 1.7073 3.2755 2.6825 1.3865 1.7389 4.7395 4.5646 4.6042 4.7294 6.3022 8.2442 4.3743 4.2388 1.6187 1.5448 2.4450 2.4328 2.6348 2.2248 4.0225 3.7633 3.0992 3.3700 2.6330 2.7236 1.5991 1.5911 1.5400 1.5406 2.2450 2.9670 3.3647 3.2291 3.7899 1.1375 1.1370 2.1573 1.3581 1.2675 1.6769 1.4008 1.1955 1.6763 1.5322 2.2626 2.2397 1.5398 1.5387 1.3122 1.4694 1.3391 1.3392 1.1839 1.1541 1.0949 1.0736 1.0580 1.0510 1.0951 1.1037 1.6395 1.2080 1.3185 1.4621 3.4965 4.2551 7.7484 7.8462 1.0597 1.0600 1.0372 1.0370 1.0616 1.0630 1.0874 1.0888 1.0773 1.0751 1.0966 1.0968 1.1023 1.1012 1.1078 1.1082 1.0999 1.0998 1.0768 1.0769
irintensity: 2.8456 0.7990 6.8662 2.3858 5.8039 15.7606 0.9419 6.2443 4.2327 0.0380 0.5192 0.7501 3.6704 26.1302 0.5434 0.5373 0.3124 3.0305 5.9208 6.1179 4.2536 11.9938 0.9969 0.8803 5.7338 26.7522 110.3182 1.9965 27.8662 61.9689 141.2774 7.8100 2.1999 6.7046 17.7599 20.1580 4.8919 8.4928 10.0608 2.8637 4.4566 29.9878 14.1143 0.0078 10.3884 59.7719 94.3248 1.4076 0.3387 35.6209 30.4943 3.9497 2.8833 2.5988 0.5479 0.4679 8.9770 6.2384 26.9022 106.5603 8.8256 10.4278 61.9838 41.6924 20.6500 135.8284 25.5816 2.1558 31.8155 97.8107 37.6799 38.5751 2.9566 2.1166 31.8248 2.7034 92.9589 10.1745 72.8567 37.9952 0.7974 2.9295 22.6134 8.1945 16.5277 24.7020 152.7052 37.5475 67.8366 36.4998 97.6661 195.2327 76.9290 406.4214 29.9293 28.0400 23.5250 32.9422 11.4083 138.3982 16.9954 16.2163 38.0497 39.4522 15.2932 14.4035 2.9295 8.3128 38.4271 27.2050 0.5243 0.4614 16.4246 17.2639
temp: 298.150 k
press: 1.00000 atm
elementType: 8 8 8 8 7 7 6 6 6 6 6 6 6 6 6 6 6 6 6 6 1 1 1 1 1 1 1 1 1 1 1 1 1 1 1 1 1 1 1 1
symmnumber: 1
zpe: 859164.2 jmol-1
zpe.correction: 0.327238 hartree
zpe.thermalcorrener: 0.348338 hartree
zpe.thermalcorrenthalpy: 0.349282 hartree
zpe.thermalcorrgfe: 0.274882 hartree
zpe.sumelectzpe: -954.364751 hartree
zpe.sumelectthermal: -954.343651 hartree
zpe.sumelectthermalent: -954.342707 hartree
zpe.sumelectthermalfe: -954.417106 hartree
dipole: 0.2991 0.7779 0.0338
dipole: 0.8341
quadrupole: -121.5299 -113.8726 -113.2560
quadrupole: 0.2770 12.9278 0.1817
quadrupole: -5.3104 2.3469 2.9635 0.2770 12.9278 0.1817
hfenergy: -954.6919889 hartree
pointgroup: C01 [X(C14H20N2O4)]
dipole: -0.1097371 0.3082343 0.0253988 debye
polarizability: 142.9279516|1.7838219|219.580549|9.4275926|-1.5436655|168.810672 unknown
InChI: InChI=1S/C14H20N2O4/c1-9-11(3-7-19-9)13(17)15-5-6-16-14(18)12-4-8-20-10(12)2/h15-16H,3-8H2,1-2H3
charge 0 multiplicity 1
40 atoms
O  2.50876 -2.434859 -0.529059
O  -2.579341 -2.271694 0.604082
O  0.747463 1.200922 -2.217238
O  -0.544152 1.299594 2.107714
N  1.501682 2.164843 -0.229324
N  -1.33152 2.255222 0.128978
C  2.416204 -0.411685 0.849764
C  -2.446927 -0.292006 -0.832371
C  1.887437 -0.19827 -0.57427
C  -1.836982 -0.072196 0.558043
C  2.66874 -1.944176 0.887404
C  -2.781968 -1.809076 -0.816133
C  1.986781 -1.371557 -1.283044
C  -1.964802 -1.220749 1.30268
C  0.795033 3.423538 -0.476088
C  -0.550001 3.481024 0.315279
C  1.339735 1.070608 -1.08336
C  -1.195287 1.175587 1.00508
C  1.663727 -1.709154 -2.703122
C  -1.590571 -1.542836 2.713869
H  3.350709 0.156978 1.027307
H  1.675565 -0.107544 1.613758
H  -3.357365 0.322337 -0.979859
H  -1.731649 -0.050058 -1.641349
H  3.682852 -2.228601 1.208258
H  1.918833 -2.483429 1.49223
H  -3.82425 -2.045749 -1.080439
H  -2.092274 -2.402986 -1.440651
H  1.429522 4.282803 -0.188372
H  0.605057 3.473593 -1.561832
H  -0.354254 3.572922 1.397275
H  -1.136859 4.359241 -0.012695
H  1.817325 1.98979 0.726826
H  -1.708295 2.078153 -0.804124
H  0.928039 -2.533768 -2.746159
H  2.571726 -2.055281 -3.23056
H  1.255943 -0.81728 -3.201891
H  -0.882237 -2.392059 2.740691
H  -2.485461 -1.848228 3.286688
H  -1.12984 -0.657815 3.177314
