program: Gaussian 09
title: 000274289
version: EM64L-G09RevD.01
frameworkgroup: C1[X(C15H10F3NO3)]
method: RPBEPBE
basis: SDD
operation: Freq
keyword: #p
keyword: freq=noraman
keyword: PBEPBE/SDD
title: #p freq=noraman PBEPBE/SDD
converged: YES YES NO NO
title: Mulliken charges:
elementType: F F F O O O N C C C C C C C C C C C C C C C H H H H H H H H H H
charge: -0.150142 -0.166041 -0.184932 -0.219333 -0.435369 -0.235914 -0.455736 0.408288 0.098115 0.165348 0.121100 -0.313525 0.109312 -0.334877 0.241104 -0.343631 -0.221302 -0.240151 -0.331862 -0.215512 -0.217190 0.097509 0.357069 0.314478 0.263700 0.260340 0.237547 0.240128 0.280691 0.241104 0.240778 0.388906
chargesum: 0.00000
title: Mulliken charges with hydrogens summed into heavy atoms:
elementType: F F F O O O N C C C C C C C C C C C C C C C
charge: -0.150142 -0.166041 -0.184932 -0.219333 -0.046463 -0.235914 -0.098667 0.408288 0.098115 0.165348 0.121100 0.000953 0.109312 -0.071177 0.241104 -0.083290 0.016245 -0.000023 -0.051171 0.025591 0.023588 0.097509
polarizability: 2.53470578e+02 -3.05982916e+01 1.83130666e+02 -3.34741121e+00 -8.90017891e+00 1.18410901e+02
1716.lowfreq: -6.8172 -6.5033 0.0005 0.0008 0.0009 4.0405 5.8824 23.9757 39.4202
frequency: 5.3384 23.7304 39.4158 47.6483 63.4397 90.3648 106.9178 117.9792 145.0490 162.1547 197.1589 208.2374 237.0178 261.8180 288.4151 325.4146 336.9388 348.4730 384.7838 405.9794 413.9329 427.2128 488.6403 509.5678 523.6600 533.8351 564.2369 585.9903 593.4340 597.3650 605.1163 655.2429 668.6357 690.3802 699.2705 712.2067 745.4958 756.3294 771.0277 773.2153 793.7246 834.6373 869.6707 893.5871 901.9397 938.7453 968.3591 975.3262 977.6854 1003.9230 1005.4121 1006.3863 1020.5061 1036.8367 1054.6788 1075.1083 1117.1173 1137.9285 1162.6994 1179.8865 1182.3908 1238.7943 1250.7165 1275.1793 1279.8929 1311.4581 1323.0919 1378.5257 1378.6141 1427.6694 1443.1074 1469.8835 1478.7771 1520.5025 1580.5950 1588.1688 1600.5042 1618.9288 1626.7784 1641.9466 3136.9593 3143.9390 3149.4460 3160.9188 3165.3898 3179.1251 3182.6264 3198.8076 3507.8959 3531.1891
redmass: 7.5137 7.8447 10.9806 9.7369 7.7751 6.8973 5.0900 5.1130 9.6147 7.4092 5.7512 6.5484 7.7251 6.6467 12.3087 9.2704 5.2785 6.4811 7.0960 4.3527 5.1690 6.5304 6.5801 4.0101 9.5448 5.3183 4.4858 3.0467 1.4845 4.7012 10.4716 5.6475 1.4485 3.4601 7.0125 4.7472 4.7341 5.6175 2.3234 1.3086 2.0774 4.9016 5.6575 1.4637 1.4699 5.8088 1.5369 1.7004 3.6960 1.3266 4.0970 1.4579 6.6183 2.7172 2.2850 3.5394 1.8730 1.7897 1.7478 1.0735 1.0636 3.0204 2.2296 1.8452 2.0014 1.9546 2.5948 8.8387 10.1128 2.1634 2.5995 2.4208 2.7353 2.2956 7.1177 7.0558 6.2045 7.0009 3.4750 8.2530 1.0866 1.0874 1.0913 1.0916 1.0966 1.0982 1.0975 1.0956 1.0772 1.0642
irintensity: 0.0942 3.4384 1.5113 1.0135 0.5927 1.8946 1.2582 0.6285 1.4432 4.2980 0.8613 2.9962 2.9661 0.1962 1.0881 5.8094 1.0944 19.7946 7.5190 8.3156 4.8054 0.3728 17.1379 7.8865 1.3821 3.7137 0.3048 56.3347 58.3005 40.8195 17.0607 6.7664 19.9312 73.6395 5.1065 20.4670 0.1244 6.1155 35.4847 120.3548 25.2581 5.3496 19.8234 3.6048 1.7663 208.4731 13.5884 26.6934 121.5303 2.2180 246.0957 27.3453 115.6843 23.7732 2.8644 38.4302 106.4077 10.7014 67.8963 0.8319 6.1705 77.8447 155.2214 87.9761 121.6988 199.1601 84.8940 102.2080 6.4138 4.3984 129.0944 18.4913 22.0498 401.5622 27.5676 203.4837 7.5598 78.6183 36.7823 250.3687 0.7520 5.0412 9.7793 8.4560 14.1525 10.1694 8.6305 10.9122 55.1618 52.8092
temp: 298.150 k
press: 1.00000 atm
elementType: 9 9 9 8 8 8 7 6 6 6 6 6 6 6 6 6 6 6 6 6 6 6 1 1 1 1 1 1 1 1 1 1
symmnumber: 1
zpe: 580410.5 jmol-1
zpe.correction: 0.221067 hartree
zpe.thermalcorrener: 0.240136 hartree
zpe.thermalcorrenthalpy: 0.241081 hartree
zpe.thermalcorrgfe: 0.170003 hartree
zpe.sumelectzpe: -1156.030373 hartree
zpe.sumelectthermal: -1156.011303 hartree
zpe.sumelectthermalent: -1156.010359 hartree
zpe.sumelectthermalfe: -1156.081436 hartree
dipole: -1.0783 0.5516 0.3798
dipole: 1.2693
quadrupole: -100.0499 -121.0463 -126.9686
quadrupole: -14.5817 -6.9627 -8.5691
quadrupole: 15.9717 -5.0247 -10.9470 -14.5817 -6.9627 -8.5691
hfenergy: -1156.2514398 hartree
pointgroup: C01 [X(C15H10F3N1O3)]
dipole: -0.4318314 -0.2363822 -0.0839123 debye
polarizability: 257.6263331|26.7677475|160.8965612|0.1451497|-27.7240914|136.4892506 unknown
InChI: InChI=1S/C15H10F3NO3/c16-15(17,18)11-7-3-4-8-12(11)19-13(20)9-5-1-2-6-10(9)14(21)22/h1-8,19,21H
charge 0 multiplicity 1
32 atoms
F  3.635747 -2.712248 0.239766
F  1.945122 -2.188435 1.654542
F  1.544103 -2.349895 -0.565699
O  -0.707858 2.175133 0.646549
O  -3.776138 1.070101 -2.63329
O  -1.500144 1.216761 -2.203097
N  0.43367 0.142714 0.263774
C  1.785481 0.563975 0.214794
C  2.831556 -0.416603 0.223728
C  -1.992998 0.117762 0.485785
C  -0.707912 0.929249 0.44244
C  2.141417 1.937766 0.148228
C  -2.971779 0.179855 -0.548614
C  4.185922 -0.017946 0.141972
C  2.521019 -1.871995 0.382921
C  -2.277333 -0.615853 1.661463
C  3.496418 2.315168 0.075747
C  4.52564 1.346172 0.064632
C  -4.220343 -0.470214 -0.379849
C  -3.519168 -1.273017 1.817848
C  -4.495443 -1.193302 0.799099
C  -2.644817 0.865961 -1.829857
H  0.250782 -0.845123 0.064736
H  1.346536 2.684579 0.155901
H  4.967832 -0.782542 0.145322
H  -1.53247 -0.657792 2.463534
H  3.747085 3.37994 0.020188
H  5.575584 1.646845 0.001278
H  -4.957377 -0.407978 -1.184729
H  -3.722975 -1.83732 2.734053
H  -5.46076 -1.695377 0.920598
H  -3.4931 1.515262 -3.476561
